Een Ontologie voor de Nederlandse Zorg-Generiek
type: Ontology
version IRI: http://purl.org/ozo/onz-g#2.6.1
created: 2020-04
creator: Roxane Segers
title: A Ontology for Dutch Care-Generic @en
accrual periodicity: New classes, properties and axioms are added when needed without a specific periodicity @en
accrual policy: Addition of new classes, properties, axioms and Individuals is driven by the editorial choice of the developers. Input for extension is derived from requests from the developers of the domain ontologies as well as the community/stakeholders of the KIK-V programme. @en
contributor: Marc Nieuwland, Eliana Papoutsoglou
description: This is 'A Ontology for Dutch Care' or 'ONZ-G', developed within the KIK-V programme (starting in 2019) of the Dutch National Healthcare Institute. The ONZ-G is a domain-independent top and core ontology that provides shared concepts, properties and design patterns for several domain-dependent domain ontologies about Dutch care institutions. The upper parts of ONZ-G are modeled following (parts of) the Descriptive Ontology for Linguistic and Cognitive Engineering (DOLCE). See: http://www.loa.istc.cnr.it/dolce/overview.html. The ONZ-G ontology is written in English but provides Dutch labels for all classes and properties. Further, many examples and definitions are also available in Dutch. @en
language: http://lexvo.org/id/iso639-3/eng
language: http://lexvo.org/id/iso639-3/nld
license: https://creativecommons.org/licenses/by/4.0/
publisher: Zorginsituut Nederland (https://www.zorginstituutnederland.nl)
relation: The ONZ-G ontology has relations to several other resources via manually created skos:matching properties: -Domain independent ontologies: DOLCE (http://www.loa.istc.cnr.it/dolce/overview.html) BFO (https://basic-formal-ontology.org/) SUMO (https://www.ontologyportal.org/) gUFO (https://nemo-ufes.github.io/gufo/) UFO (https://ontology.com.br/) -Domain ontologies: OWL-Time (https://www.w3.org/TR/owl-time/) SNOMED (https://bioportal.bioontology.org/ontologies/SNOMEDCT) STY (https://bioportal.bioontology.org/ontologies/STY) FMA, Foundational Model of Anatomy, (https://bioportal.bioontology.org/ontologies/FMA) OAE, Ontology of Adverse Events, (https://bioportal.bioontology.org/ontologies/OAE) ICPS, International Classification for Patient Safety, (https://bioportal.bioontology.org/ontologies/ICPS) NCIT, National Cancer Institute Thesaurus, (https://bioportal.bioontology.org/ontologies/NCIT) DOID, Human Disease Ontology, (https://bioportal.bioontology.org/ontologies/DOID) FIBO, Financial Business Ontology, (https://spec.edmcouncil.org/fibo/ontology) -Other: ZIB, Zorg Informatie Bouwstenen, (https://zibs.nl/wiki/ZIB_Hoofdpagina) BAG, Basisadministratie Adressen en Gebouwen (https://bag.basisregistraties.overheid.nl/def/bag#) DBpedia (https://www.dbpedia.org/) @en
type: http://omv.ontoware.org/2005/05/ontology#CoreOntology
type: http://omv.ontoware.org/2005/05/ontology#UpperLevelOntology
number of annotation properties: 62
number of external mappings: 326 (using skos:closeMatch and skos:exactMatch)
preferred namespace prefix: onzg
preferred namespace uri: http://purl.org/ozo/onz-g
bug-database: issues
repository: https://gitlab.com/kik-v/ontologie/source
root resource: Particular
backward compatible with: onz-g 2.2.0, onz-g 2.6.0
deprecated: false
incompatible with: vph-g 1.0.0
prior version: onz-g 2.6.0
version info: 2.1.1: updating referrals to new versions ZIB url.(RS) 2.2.0: added OccupancyQuality, OccupancyValue and hasOccupancyObject plus explicit inverse OP. (RS) 2.3.0: Reverted the deprecation of theTimeStamp dataproperties. (RS) Transfer of DurationValue from domain ontology to ONZ-G, addition of axiom to allow for percentages (MN). 2.3.1: Additional and explanatory comment for BiologicalSex and AnimacyQuality about the absence of a defined quality region pattern to specific values. (RS) 2.4.0: Addition of several new classes and axioms for modeling invoices, i.e. Invoice, Tariff, CureAndCareTariff, CureAndCareProcess, CureAndCareIdentificationCode. (RS) 2.5.0: Addition of classes Rent and ServiceCharge, object property is AttributedFinancialEntityOf and additional axiom for FinancialEntity and FinancialTransaction. (RS) 2.6.0: Conflicting and redundant axiom removed for class CureAndCareIdentificationCode. Update of metadata. (RS) 2.6.1: Updating references to the 2024 version of the ZIBs. (RS) @en
acronym: ONZ-G
browsing UI: https://kik-v-publicatieplatform.nl/ontologie/onz-g/2.6.1
byte size: 508
definition property: definition
generalizes: http://purl.org/ozo/onz-pers# http://purl.org/ozo/onz-org# http://purl.org/ozo/onz-zorg# http://purl.org/ozo/onz-fin#
has representation language: http://dbpedia.org/resource/Web_Ontology_Language
has syntax: RDF XML
number of axioms: class restrictions: 83 disjointness:5 subclassOf:395
number of classes: 395
number of data properties: 10
number of individuals: 40
number of object properties: 52 @en
used in project: Programma Keteninformatie Verpleeghuiszorg (https://www.kik-v.nl/)
vocabulary used: http://www.w3.org/2002/07/owl# http://www.w3.org/2000/01/rdf-schema# http://www.w3.org/1999/02/22-rdf-syntax-ns# http://www.w3.org/XML/1998/namespace http://www.w3.org/2001/XMLSchema# http://www.w3.org/2004/02/skos/core# http://purl.org/dc/elements/1.1/ http://purl.org/dc/terms/ http://xmlns.com/foaf/0.1/ https://w3id.org/mod# http://usefulinc.com/ns/doap# http://purl.org/vocab/vann/ http://vocab.deri.ie/void#

created
type: AnnotationProperty
editorial note: Voor de ontologie als geheel EN als annotatie bij de klassen, OPs, DPs en Individuals.

creator
type: AnnotationProperty
editorial note: Voor de ontologie als geheel EN als annotatie bij de klassen, OPs, DPs en Individuals.

accrualPeriodicity
type: AnnotationProperty
editorial note: (wijzigingsbeleid temporeel)

accrualPolicy
type: AnnotationProperty
editorial note: (wijzigingsbeleid inhoudelijk)

language
type: AnnotationProperty
editorial note: Als metadata voor ontologie als geheel. Graag: http://lexvo.org/id/iso639-3/nld en/of http://lexvo.org/id/iso639-3/eng

modified
type: AnnotationProperty
editorial note: voor gebruik op klasseniveau. Zie ook skos:changeNote.

publisher
type: AnnotationProperty
editorial note: (ZIN, plus url)

relation
type: AnnotationProperty
editorial note: (Als metaproperty voor de ontologie als geheel: lijst van gerelateerde resources, dus die worden gebruikt in de mappings (onz-g) of deels als individual terugkomen zoal 'RGS', etc. Graag naam van resource en uri/url)

type
type: AnnotationProperty
editorial note: uri voor de domeinontologie: http://omv.ontoware.org/2005/05/ontology#DomainOntology

hasApproximateZIBLabel
type: AnnotationProperty
comment: This annotation property is used to define an association to a so called ZIB entity as defined in https://zibs.nl/wiki/Hoofdpagina. (By absence of stable URIs in this resource, we do not use SKOS mapping properties for now). @en
deprecated: true

hasLexicalExpressions
type: AnnotationProperty
comment: This annotation property is used to associate a concept in the ontology with a set of lexical expressions or words in a Natural language such as Dutch. This annotation property is intended to accommodate access to the ontology for non-experts by look-ups of words and terms instead of class and property labels. For example: if one searches for the Dutch term 'uitgiftefout', the class onz-g:ErroneousDispenseOfMedicalSubstance will be shown. Note that words can have multiple meanings, so one word can be associated with multiple concepts in the ontology as well. For example, a lookup for the Dutch word 'gemeente' results in two different classes: onz-g:MunicipalityArea (a place where you can live) AND onz-g:MunicipalityGovernment (the organization that governs this area). Also note that currently this property has been used for about a third of all classes in onz-g and for Dutch only. Also, the set of associated words is indicative and not exhaustive. @en
deprecated: true

bug-database
type: AnnotationProperty
editorial note: (hier link naar de issue lijst op Gitlab)

changeNote
type: AnnotationProperty
editorial note: klasse-annotaties.

editorialNote
type: AnnotationProperty
comment: This annotation property is used for any remarks, questions and considerations that are primarily intended for the ontology modelers and do not need to be included in the publication of the ontology. Editor Notes may include for example 'to do's', initial axiomatizations and things to check with domain experts. @en

acronym
type: AnnotationProperty
editorial note: (gewenste afkorting ontologie, bijvoorbeeld 'ONZ-G')

browsingUI
type: AnnotationProperty
editorial note: (hier link naar de Widoco html of een andere html)

competencyQuestion
type: AnnotationProperty
editorial note: graag verwijzen naar url(s) indicatoren die feitelijk de competency questions voor de domeinontologieen zijn. Alternatief: de vragen letterlijk even overnemen. https://gitlab.com/kik-v/gevalideerde-vragen/documentatie/-/tree/11-indicatoren-zorgkantoren/content/docs/IGJ

definitionProperty
type: AnnotationProperty
editorial note: (voor alle ontologieen: skos:definition)

specializes
type: AnnotationProperty
editorial note: Voor de domeinontologieen: ONZ-G.

vastgesteld tijdens
type: ObjectProperty
sub property of: inverseObjectProperty
inverse of: stelt vast
comment: This object property is for modeling the relation between some Quality of some Entity that is assessed in some AssessmentEvent, e.g. the 'length' of a human or the 'profitability' of some company. @en

stelt vast
type: ObjectProperty
comment: This object property is for modeling the relation between some AssessmentEvent and the Quality of some Entity that is assessed, e.g. the 'length' of a human or the 'profitability' of some company. Example: 'measuring' (AssessmentEvent) assesses 'length' (Quality) of some umbellical cord/human/mattress (Objects). @en

draagt
type: ObjectProperty
inverse of: gedragen door
comment: This object property is for modeling the relation between some ContentBearingObject and the InformationObject that it bears, e.g. 'a newspaper' bears some 'news' (inverse: 'information' bornyBy 'news'). @en
label: bears @en

gedragen door
type: ObjectProperty
sub property of: inverseObjectProperty
comment: This object property is for modeling the relation between some InformationObject and some ContentBearingObject, e.g. 'news' borneBy 'newspaper' (inverse: 'newspaper' bears 'news'). @en

bevat
type: ObjectProperty
sub property of: is objectlocatie van
inverse of: wordt omvat door
comment: This object property is for modeling that some CorpuscularObject is contained by some other CorpuscularObject, e.g. 'the dispenser contains diapers'; 'the bottle contains milk'. Inverse property: isContainedBy (the milk is contained by the bottle', 'the diapers are contained by a dispenser'). Note that this property should only be used when the CorpuscularObject that is contained is NOT an intrinsic/functional part or otherwise attached to the other Corpuscular. In that case, we refer to hasPart and the hasMember properties. "This hotel has three rooms" (hasPart); "The board has three members" (hasMember); "The airplace *can* transport 40 tonnes cargo (hasCapacityQuality); "The airplane contains 23 tonnes cargo (contains). @en

gedefinieerd door
type: ObjectProperty
sub property of: is onderwerp van
inverse of: definieert
domain: Particular
range: Abstract informatieobject
comment: This object property is for modeling the relation between some InformationObject that is defined by some Particular. Example: 'RequiredcareAgreement (Zorgprofiel) defines LongTermCareService' / 'LongTermCareService is definedBy Zorgprofiel'. @en

definieert
type: ObjectProperty
sub property of: gaat over
domain: Abstract informatieobject
range: Particular
comment: This object property is for modeling the relation between some InformationObject that defines some Particular, for example: RequiredcareAgreement (Zorgprofiel) defines LongTermCareService / LongTermCareService is definedBy Zorgprofiel. @en

formeel gedefinieerd door
type: ObjectProperty
sub property of: gedefinieerd door
inverse of: definieert formeel
domain: Particular
range: Abstract informatieobject
comment: This object property is for modeling the relation between some Particular that is formally defined by some SocialInformationObject such as a Law or official Agreement. For example: 'Wet Langdurige Zorg' (a specific healthcare law in the Netherlands) formallyDefines LongTermCareService / LongTermCareService isFormallyDefinedBy 'Wet Langdurige Zorg'. @en

definieert formeel
type: ObjectProperty
sub property of: definieert
domain: Abstract informatieobject
range: Particular
comment: This object property is for modeling the relation between some SocialInformationObject such as a Law or official Agreement that formally defines some Particular. For example: 'Wet Langdurige Zorg' (a specific healthcare law in the Netherlands) formallyDefines LongTermCareService / LongTermCareService isFormallyDefinedBy 'Wet Langdurige Zorg'. @en

bestuurd door
type: ObjectProperty
sub property of: is operatieregio van
inverse of: bestuurt

bestuurt
type: ObjectProperty
sub property of: opereert in regio
comment: GovernmentOrganization - governs - GeopoliticalArea @en
comment: This object property is for modeling that some GovernmentOrganization governs over some GeopoliticalArea. Example: 'French government' governs 'France' inverse: 'France' governedBy 'French government'. @en

heeft vastgesteld waarderesultaat
type: ObjectProperty
inverse of: is vastgesteld waarderesultaat van
comment: This object property is for modeling the relation between some AssessmentEvent and some QualityValue that is acquired as a result of this AssessmentEvent. Note that the 'thing' that is assessed is usually some Quality of some Entity, e.g. the 'length' of a human or the 'profitability' of some company. Example: '14' is a LengthValue with 'centimeter' as its UnitOfMeasurement '14' is the isAssessmentValueResultOf some MeasurementEvent that took place at hasTime '2021'. (some MeasurementEvent hasAssessmentValueResult e.g. '14' (a LengthValue and with 'centimeter' as UnitOfMeasurement). @en

heeftToegekendeFinanciëleEntiteit
type: ObjectProperty
inverse of: isToegekendeFinanciëleEntiteitVan

heeft capaciteitsobject
type: ObjectProperty
inverse of: is capaciteitsobject van
comment: This object property is for modeling the relation between some CapacityQualityValue and the PhysicalObject that is contained by some other PhysicalObject with reification via a quality region pattern. Note that this property should only be used when the PhysicalObject that is contained is NOT an intrinsic/functional part or otherwise attached to the other PhysicalObject. In that case, we refer to hasPart and the hasMember properties: "This hotel has three rooms" (hasPart); "The board has three members" (hasMember); We refer to the pattern library for a visualization of the capacity patterns. @en

heeft semantische rol participant
type: ObjectProperty
sub property of: heeft participant
inverse of: is semantische rol participant in
comment: This object property is for modeling the semantic role participation relation of some CaseRole in some Perdurant. For example, if some nurse applies a bandage on a soldier, then the nurse, the bandage and the soldier are all three participantIn some 'applying'. By means of the hasCaseRoleParticipant property, we can further define the specific semantic roles of each participant in this event, e.g. the nurse will have an AgentCaseRole (doing something), the soldier will have the PatientCaseRole (undorgoing something) while the bandage will have the InstrumentCaseRole (used as instrument in the event. Also see the class CaseRole and its subclasses for more information and examples. @en

heeft generieke locatie
type: ObjectProperty
inverse of: is generieke locatie van
comment: For future modeling purposes only. @en
label: hasGenericLocation @en
editorial note: Please do not use or instantiate. @en

heeft lokaliseerbaar gebied
type: ObjectProperty
sub property of: heeft generieke locatie
comment: This object property is for modeling that some StationaryArtifact can be located on some LocalizableArea, e.g. 'this building is on some area (that is identified with an address)'. Or: AccomodativeObject hasLocalizableArea some LocalizableArea; LocalizableArea definedBy some LocalizablePlaceInformationObject (such as an Address). (no inverse property defined) @en

heeft onderwerp van bijeenkomst
type: ObjectProperty
inverse of: is bijeenkomstonderwerp van
domain: Bijeenkomst
comment: This object property is for modeling the relation between some Meeting and the Particular the meeting is (intended to be) about. For example: - Meeting hasMeetingTopic Decubitus And the inverse: - Decubitus isMeetingTopicOf Meeting. @en

heeft lid
type: ObjectProperty
inverse of: is lid van
comment: This object property is for modeling the membership relation between Collections and Endurants, e.g. 'flock hasMember sheep', 'convoy hasMember trucks'. Note that this property is basically a specific type of part-of relation where the 'parts' that make up the collection are more or less uniform. This is different from the classical part-of relation where the parts can be different in relation to eachother and where the exclusion of some part can affect the functionality or wholeness of the whole, e.g. car hasPart engine/wheel/exhaust. In other words: a collection can lose a member while still being a collection while some CorpuscularObject can not lose parts without some implications for the functionality or existence of the whole. @en
label: hasMember @en

heeft objectlocatie
type: ObjectProperty
sub property of: heeft generieke locatie
inverse of: is objectlocatie van
comment: This object property is for modeling that CorpuscularObjects can be located in/on/at some other CorpuscularObject, e.g. 'the book is on the table'. For modeling that e.g. some CorpuscularObject is located at some area/place/location (e.g. 'the package is in Amsterdam', 'the camp site is at Latitude: 46.3890764. Longitude: 13.746901.'), we refer to the generic quality region pattern involving the classes: SpatialQuality and SpatialValue. @en

heeftBezettingsObject
type: ObjectProperty
created: 03/2023
creator: RS
comment: This object property is for modeling the relation between some OccupancyQualityValue and the Organism that occupies some StationaryArtifact with reification via a quality region pattern. @en

opereert in regio
type: ObjectProperty
inverse of: is operatieregio van
comment: This object property is for modeling that some Organizations operate (e.g. execute commercial and or administrative actions) in some Area. Example: 'HEMA' hasOperatingRange 'Benelux' 'Zorgkantoor' hasOperatingRange 'Zorgkantoorregio' @en

heeft deel
type: ObjectProperty
inverse of: deel van
type: TransitiveProperty
comment: This object property is for modeling that some Particular can have some other Particular as its part, e.g. 'car hasPart engine' or 'making incision partOf heart surgery'. Note that this is a transitive property, meaning that if B is part of Aand C is part of B then C is part of A as well. Also, some classes can have a partOf relation to itself, e.g. Organization hasPart Organization for defining that any suborganization or division of some Organization is also an Organization. Note however that this property does not imply that the parts of some entity need to be uniform or homogenous. For 'parts' that are homogenous or uniform, we refer to the object property hasMember. @en
label: hasPart @en

heeft participant
type: ObjectProperty
inverse of: is participant in
comment: This object property is for modeling the participation relation of some Endurant in some Perdurant, e.g. 'erosion hasParticipant wind', 'apply bandage hasParticipant nurse'. Note that there are no formal exclusions on what/who can participate in some Perdurant, meaning that the 'participant' does not need to be agentive or cognitive unless defined specifically so in some class restriction. @en
label: hasParticipant @en

heeft perdurantlocatie
type: ObjectProperty
sub property of: heeft generieke locatie
inverse of: is perdurant locatie van
comment: This object property is for modeling that some Perdurants generically take place in/on some CorpuscularObject, e.g. 'operations take place in some operating theatre, 'some specific care processes take place in a nursing home'. For modeling that e.g. some specific Perdurant takes place at some area/place/location (e.g. 'the meeting is in Diemen', 'his operation took place in the Amsterdam Medical Centre'), we refer to the generic quality region pattern involving the classes: SpatialQuality and SpatialValue and their subclasses. @en

heeft eigenschap of kenmerk
type: ObjectProperty
inverse of: is eigenschap of kenmerk van
comment: This object property is for modeling the relation between a SpatioTemporalParticular and the Quality it can have, for example 'Organism hasQuality BodyMass' (inverse: BodyMass inheresIn Organism). @en
label: hasQuality @en

heeft eigenschapswaarde
type: ObjectProperty
inverse of: is eigenschapswaarde van
comment: This object property is for modeling the QualityValue associated with some Quality and is part of the quality region pattern. See also QualityValue for some explanation and examples. @en

heeft meeteenheid
type: ObjectProperty
inverse of: is meeteenheid van
comment: This object property is for modeling the relation between some QualityValue and the UnitOfMeasure that is used for this QualityValue. For example: '12' hasUnitOfMeasure 'liter' '12' hasUnitOfmeasure 'kilo'. Inverse: 'liter' isUnitOfMeasureOf '12'. @en

geïdentificeerd door
type: ObjectProperty
sub property of: inverseObjectProperty
inverse of: identificeert
comment: This object property is for modeling the relation between some Particular that is identified by some IdentifierInformationObject For example: EmployeeIdentifier identifies Employee / Address identifies LocalizableArea. and the inverse: Employee identifiedBy EmployeeIdentifier / LocalizableAre identifiedBy Address. @en

identificeert
type: ObjectProperty
comment: This object property is for modeling the relation between some IdentifierInformationObject and the Particular that it identifies. For example: EmployeeIdentifier identifies Employee / Address identifies LocalizableArea. Inverse: identifiedBy. @en

is eigenschap of kenmerk van
type: ObjectProperty
sub property of: inverseObjectProperty
comment: This object property is for modeling the relation between a Quality that inheres in ('is carried by') some SpatioTemporalParticular. Example 'Organism hasQuality BodyMass' and the inverse: 'BodyMass inheresIn Organism'. @en

gaat over
type: ObjectProperty
inverse of: is onderwerp van
domain: Abstract informatieobject
range: Particular
comment: This object property is for modeling the relation between some InformationObject and the Endurant it is about, where the Endurant serves as a 'topic'. Example: 'EmploymentContract isAbout 'OccupationalPositionRole' ('OccupationalPositionRole' isAboutnessOf EmploymentContract). Note that any class can serve as 'topic'. Hence, duplicating classes for modeling 'topics' is not advised in order to minimize redundancy. @en
label: isAbout @en

is onderwerp van
type: ObjectProperty
sub property of: inverseObjectProperty
domain: Particular
range: Abstract informatieobject
comment: This object property is for modeling the relation between some Endurant that is the 'topic' of some InformationObject. Example: 'EmploymentContract isAbout 'OccupationalPositionRole' ('OccupationalPositionRole' isAboutnessOf EmploymentContract) Note that any class can serve as 'topic'. Hence, duplicating classes for modeling 'topics' is not advised in order to minimize redundancy in the ontology. @en

is vastgesteld waarderesultaat van
type: ObjectProperty
sub property of: inverseObjectProperty
comment: This object property is for modeling the relation between some QualityValue that is acquired as a result of some AssessmentEvent. Note that the 'thing' that is assessed is usually some Quality of some Entity, e.g. the 'length' of a human or the 'profitability' of some company. Example: '14' is a LengthValue with 'centimeter' as its UnitOfMeasurement '14' is the isAssessmentValueResultOf some MeasurementEvent that took place at hasTime '2021'. @en

isToegekendeFinanciëleEntiteitVan
type: ObjectProperty
sub property of: inverseObjectProperty
created: 10-23
creator: RS
comment: This object property is used to define that FinancialEntities such as 'price', 'tariff', 'investment', 'rent', are attributed to some SpatioTemporalParticular such as a concrete object (a winter coat) or a service (admission to a theatre, a brain surgery), etc. @en

is capaciteitsobject van
type: ObjectProperty
sub property of: inverseObjectProperty
comment: This the inverse object property of 'hasCapacityObject' that is for modeling the relation between some CapacityQualityValue and the PhysicalObject that is contained by some other PhysicalObject with reification via a quality region pattern. Note that this property should only be used when the PhysicalObject that is contained is NOT an intrinsic/functional part or otherwise attached to the other PhysicalObject. In that case, we refer to hasPart and the hasMember properties. "This hotel has three rooms" (hasPart); "The board has three members" (hasMember); "The airplane has four engines (hasPart) and can transport 40 tonnes cargo (CapacityQuality and hasCapacityValue). See the pattern library for a visualization. @en

is semantische rol participant in
type: ObjectProperty
sub property of: is participant in

wordt omvat door
type: ObjectProperty
sub property of: heeft objectlocatie
comment: This object property is for modeling that some CorpuscularObject is contained by some other CorpuscularObject, e.g. 'the milk is contained by the bottle', 'the diapers are contained by a dispenser', etc. Inverse property: contains (dispenser contains diapers; bottle contains milk). Note that this property should only be used when the CorpuscularObject that is contained by some other CorpuscularObject is NOT an intrinsic/functional part or otherwise attached to the other Corpuscular. In that case, we refer to hasPart and the hasMember properties. "This hotel has three rooms" (hasPart); "The board has three members" (hasMember); "The airplace *can* transport 40 tonnes cargo (hasCapacityQuality); "The airplane contains 23 tonnes cargo (contains). "23 tonnes cargo is contained by that airplance (isContainedBy). @en

is generieke locatie van
type: ObjectProperty
sub property of: inverseObjectProperty
comment: For future modeling purposes only; please do not use or instantiate. @en
label: isGenericLocationOf @en

is bijeenkomstonderwerp van
type: ObjectProperty
sub property of: inverseObjectProperty

is lid van
type: ObjectProperty
sub property of: inverseObjectProperty

is objectlocatie van
type: ObjectProperty
sub property of: is generieke locatie van
comment: This object property is for modeling that CorpuscularObjects are the location of some other CorpuscularObject, e.g. 'the table is the object location of the book. For modeling that e.g. some area/place/location (e.g. 'the package is in Amsterdam', 'the camp site is at Latitude: 46.3890764. Longitude: 13.746901.') is the location of some CorpuscularObject, we refer to the generic quality region pattern involving the classes: SpatialQuality and SpatialValue. @en

is operatieregio van
type: ObjectProperty
sub property of: inverseObjectProperty

is participant in
type: ObjectProperty
sub property of: inverseObjectProperty

is perdurant locatie van
type: ObjectProperty
sub property of: is generieke locatie van

is eigenschapswaarde van
type: ObjectProperty
sub property of: inverseObjectProperty

is verblijf van
type: ObjectProperty
sub property of: inverseObjectProperty
inverse of: heeft verblijf in

is rol gedragen door
type: ObjectProperty
sub property of: inverseObjectProperty
inverse of: draagt rol

is meeteenheid van
type: ObjectProperty
sub property of: inverseObjectProperty

deel van
type: ObjectProperty
sub property of: inverseObjectProperty
type: TransitiveProperty

draagt rol
type: ObjectProperty
comment: This object property is for modeling the relation between some Endurant en a Role, for example 'Human playsRole Nurse ' (inverse: Nurse isRolePlayedBy Human). Note that roles can play roles themselves. @en

heeft verblijf in
type: ObjectProperty
comment: This object property is for modeling the relation between some Organization and/or Organism that typically resides/lives in some StationaryArtifact, e.g. 'HospitalOrganization residesIn HospitalBuilding', 'rabbit residesIn burrow'. Note that this property does not imply that at any given point in time the Organism or Organization is actually at/in this StationaryArtifact making it substantially different from e.g. SpatialQualities. Also note that StationaryArtifact themselves extend in space and have a location in relation to something else. Therefore: some NursingHomeOrganization residesIn some NursingHomeBuilding and this NursingHomeBuilding has a SpatialQuality/SpatialValue. @en
label: is gevestigd in

einddatum
type: DatatypeProperty
sub property of: heeftEindTijd

heeftBeginTijd
type: DatatypeProperty
sub property of: heeft tijdwaarde
editorial note: Voor het modelleren van startdatum, begindatum, etc.

heeft datawaarde
type: DatatypeProperty

heeft datum
type: DatatypeProperty
sub property of: heeft tijdwaarde

heeft geboortedatum
type: DatatypeProperty
sub property of: startdatum
type: FunctionalProperty

heeft sterfdatum
type: DatatypeProperty
sub property of: einddatum
type: FunctionalProperty

heeft tijdsduur
type: DatatypeProperty
sub property of: heeft tijdwaarde

heeftEindTijd
type: DatatypeProperty
sub property of: heeft tijdwaarde
editorial note: Voor modelleren van einddatum, vervaldatum, hersteldatum etc.

heeft tijdwaarde
type: DatatypeProperty
comment: Generieke dataproperty, lokaal te gebruiken met een xsd restrictie.

startdatum
type: DatatypeProperty
sub property of: heeftBeginTijd

Abnormale morfologische eigenschap
type: Class
subclass of: Organische eigenschap
creator: RS
comment: Note that AbnormalOrganicMorphology includes subclasses (e.g. onz-g:Wound) that intuitively may seem to be a CorpuscularObject or OrganicObject. Note however that Wound is a condition that inheres in some Human and denotes the absence of or damage to some tissue. As such, it can not be an Object. @en
definition: Editorial: AbnormalOrganicMorphologyQuality is BiologicalQuality which may inhere in some Organism as a result of e.g. some InjuringEvent, PathologicalProcess or the existence of some DiseaseOrSyndrome in that Organism. @en
example: Examples: a bone being broken, a wound, an ulcer, a pimple, a blister, etc. @en

Abstracte entiteit
type: Class
subclass of: Particular
disjoint with: TijdEnPlaatsGebondenEntiteit
creator: RS
comment: As an example: the idea of the number *14* is an AbstractParticular that has no inherent attributes that extend in time or space. Note however that '14' can be a specific value of some attribute at some time, meaning that the idea of *14* is 'materialized'. @en
label: AbstractParticular @en
broad match: http://purl.org/nemo/gufo#AbstractIndividualType
definition: DOLCE: The main characteristic of abstract entities is that they do not have spatial nor temporal qualities, and they are not qualities themselves. @en

Abstracte eigenschap
type: Class
subclass of: Eigenschap of kenmerk
creator: RS
comment: Note that Qualities may also inhere in other Qualities. For instance, if John has a PressureUlcer (a BiologicalQuality), then some additional quality such as onz-g:MedicalRatingQuality can be used to indicate the stage or severity of the ulcer according to some onz-g:MedicalClassificationSystem. @en
comment: Specific qualities for modeling subjective assessment will be modeled in a later phase; note however that a set of corresponding onz-g:SubjectiveValues is already incorporated (see:onz-g:AbstractValue and subclasses). @en
definition: Editorial: AbstractQuality is a Quality that inheres in NonPhysicaEndurants and other Qualities. @en

Abstracte rol
type: Class
subclass of: Rol
creator: RS
definition source: Loebe, F. (2007). Abstract vs. social roles–Towards a general theoretical account of roles. Applied Ontology, 2(2), 127-158. @en
definition: Loebe (2007): Abstract roles can be functionally characterized in a uniform manner, namely as a mechanism of viewing some entity – namely the player – in a defined context, i.e., in a more complex entity with interrelated other “notional components”. Put differently, players of abstract roles are looked at in an external manner in contrast to viewing them as self-contained entities focusing on their internals like their properties or parts. @en

Abstracte waarde
type: Class
subclass of: Waarde
creator: RS
comment: Instances of AbstractValue are atomic regions or qualia in some value space. Our conception of AbstractValue comes close to dul:AbstractRegion where the focus is on the region, not the qualia. Due to this difference, we defined no mapping from this class to DOLCE. @en
definition: Editorial: Instances of AbstractValue express values of abstract qualities such as EducationLevel, EmotionalState and SeverityOfMedicalCondition. @en

Verblijfsobject
type: Class
subclass of: Onverplaatsbaar artefact
creator: RS
definition: Editorial: AccomodativeObject is a StationaryArtifact that is functionally independent, serves as accommodation for human activities and can be part of one or multiple Buildings. @en
editorial note: De BAG hierarchie voor Verblijfsobjecten kan hier desgewenst ingeplugd, behalve 'bag:ligplaats' en 'bag:staplaats'. En dan iets als: Organization subclassOf *residesIn only AccomodativeObject (er zijn immers organisaties die NIET in een Verblijfsobject zitten) AccomodativeObject subclassOf *partOf some Building/Pand waarbij: StationaryArtifact subclassOf *hasPlace only LocalizablePlace LocalizablePlace equivalentTo *hasIdentifier some LocalizablePlaceInformationObject
example: Examples: 'apartment', 'loft', etc. @en

Account
type: Class
subclass of: Overeenkomst
creator: RS
definition: Editorial: Account is an Agreement that expresses some arrangement about providing some service from one party to another, often but not necessarily in exchange for some compensation. @en
example: Examples: 'a bank account', 'a user account', 'an email account', 'a Facebook account', etc. @en

ADL-waarde
type: Class
subclass of: Organisme-eigenschapswaarde
creator: RS
relation: https://zibs.nl/wiki/BarthelIndex-v3.2(2024NL)
comment: For an extensive set of standardized and descriptive values such as 'does not shower self', 'difficulty feeding self', 'does perform dressing activity', we refer to SNOMED. Alternatively, values as defined and standardized in the Barthel Index may be used. Note that this Barthel Index has been modeled as an instance of onz-g:MedicalClassificationSystem. @en
broad match: http://purl.bioontology.org/ontology/SNOMEDCT/248536006
definition: Editorial: Instances of ActivitiesOfDailyLifeValue express whether and/or to what degree some Human is capable to execute actions associated with self care @en

Vermogen tot uitvoeren van zelfzorg
type: Class
subclass of: Organische eigenschap
subclass of: Restriction
  all values from: ADL-waarde
  on property: heeft eigenschapswaarde
creator: RS
comment: Note that we do not model any specific capabilities associated with activities of daily living in onz-g. Instead, we refer to existing domain-specific sources for these, such as e.g. SNOMED, the Barthel Index and the Dutch ZIB. -Specific actions such as 'eating' and 'taking a shower' in the ZIB can be considered as subtypes of onz-g:ActivitiesOfDailyLivingCapabilities. The specific functional scores for these activities can be modeled as onz-g:ActivitiesOfDailyLivingValue using the quality region pattern. -In SNOMED, a set of abilities related to daily living are best represented by 'Activity of daily living' that refers not to actions but the capability to perform these actions. See the mapping for the URI. -In SNOMED, a set of specific set of values are modeled as subclasses of 'Finding of functional performance and activity', and more specifically 'Finding of activity of daily living' e.g. 'able to feed self' and 'able to perform dressing activity'. These should be modeled as instances of onz-g:ActivitiesOfDailyLivingValue, NOT as subtypes of this class. -The Barthel Index is modeled as an instance of onz-g:MedicalClassificationSystem. see also: https://zibs.nl/wiki/BarthelIndex-v3.1(2022NL) and onz-g:ActivitiesOfDailyLivingValue. @en
definition: Editorial: ActivitiesOfDailyLivingCapability is a BiologicalQuality that characterizes whether and/or to what degree some Human is capable to execute actions associated with self care and self sustenance such as 'taking medications' and 'brushing teeth'. @en

Adres
type: Class
subclass of: Localiseerbaar-gebiedsidentifier
creator: RS
relation: https://zibs.nl/wiki/Adresgegevens-v1.2(2024NL)
comment: Note that the parts of some Address such as 'postcode' or 'domicile' are InformationObjects as well. @en
definition: Address is a LocalizablePlaceInformationObjects that represents a set of standardized information to identify some LocalizablePlace. @en

Administratief informatieobject
type: Class
subclass of: Maatschappelijk informatieobject
creator: RS @en
definition: AdministrativeInformationObject is a SocialInformationObject that expresses (uniformized) conceptions as they function specifically and exclusively in the administrative realm. @en

Administratief gebied
type: Class
subclass of: Geografisch gebied
creator: RS
definition: Editorial: AdministrativeRegion is a GeographicArea that has been allocated for administrative and collaborative purposes by some GovernmentOrganization and/or ServiceOrganization. @en
example: Specifieke voorbeelden voor Nederland zijn 'zorgregio', 'veiligheidsregio', 'zorgkantoorregio'.

Wilsverklaring
type: Class
subclass of: Fysiek certificaat
creator: RS
relation: https://zibs.nl/wiki/Wilsverklaring-v4.3(2024NL)
definition: Editorial: Een Wilsverklaring is een beschrijving van de wensen van een Persoon omtrent hoe er medisch gehandeld moet worden wanneer deze Persoon niet langer zelfstandig beslissingen kan nemen vanwege wilsonbekwaamheid veroorzaakt door een ziekte of een aandoening.
definition: Wikipedia: AdvanceHealthcareDirective is an Agreement in which a Person specifies what actions should be taken for their health if they are no longer able to make decisions for themselves because of illness or incapacity. @en

Leeftijd
type: Class
subclass of: Organische eigenschap
subclass of: Restriction
  all values from: Leeftijdswaarde
  on property: heeft eigenschapswaarde
creator: RS
definition: Editorial: Age is a Quality that inheres in Organisms and indicates the amount of time that has passed since the Organism came into existence in relation to some other point in time. @en

Leeftijdswaarde
type: Class
subclass of: Organisme-eigenschapswaarde
creator: RS
comment: Note that the unit of measurement such as 'years' and 'days' can be specified with a UnitOfDuration. @en
definition: Editorial: Instances of AgeValue indicate the values for the Quality Age of some Organism. @en
example: Examples: '14' (weeks), '43' (years), 'adult', 'senior', etc. @en

Agens
type: Class
subclass of: Rol
creator: RS
definition: sumo:"Something or someone that can act on its own and produce changes in the world."

Agens semantische rol
type: Class
subclass of: Semantische rol
creator: RS
comment: Examples: "MARY hit John." "A FALLING ROCK broke my left arm." @en
definition: Editorial: An AgentCaseRole is played by an active participant, either animate or inanimate, of some Perdurant, with or without intention. @en

Overeenkomst
type: Class
subclass of: Maatschappelijk informatieobject
creator: RS
definition: Editorial: Agreement is a SocialInformationObject that expresses some negotiated and possibly legally binding arrangement between parties as to some situation or action. @en

Levend
type: Class
subclass of: Levend of dood-eigenschap
creator: RS
definition: Editorial: Alive is the AnimacyQuality that characterizes that some Organism is alive. @en

Anatomisch cluster
type: Class
subclass of: Menselijke anatomische entiteit
creator: RS
definition source: http://purl.org/sig/ont/fma/fma49443
definition: FMA: "anatomical structure, each instance of which has as it direct parts a heterogeneous collection of some instances of two or more subclasses of anatomcial structure, which are spatially related to one another; the collections as a whole does not satisfy the definition of any other subclass of anatomical structure. Examples: root of lung, back, anatomical snuffbox, motor unit, juxtaglomerular complex." @en

Anatomische entiteit
type: Class
subclass of: Organisch object
creator: RS
definition: AnatomicalEntity is an OrganicObject "which is generated by coordinated expression of the organisms own genes that guide its morphogenesis; has inherent 3D shape; its parts are connected and spatially related to one another in patterns determined by coordinated gene expression." Definition derived from: The Foundational Model of Anatomy Ontology (FMA). (http://purl.org/sig/ont/fma.owl) @en

Levend of dood-eigenschap
type: Class
subclass of: Organische eigenschap
disjoint union of: Levend
disjoint union of: Dood
creator: RS
comment: Note that most of the qualities in the ONZ ontologies follow the quality region patttern as their possible values occupy a value space. For the Quality onzg:AnimacyQuality this value space is argued not to exist as one is either dead or alive, Schrödinger-like situations aside. Hence, Dead and Alive have been modeled as disjoint subclasses of AnimacyQualities. @en
definition: Editorial: AnimacyQuality is an BiologicalQuality that inheres in Organisms and characterizes the animate state of this Organism, more precisely if it is Dead or Alive. @en

Dier
type: Class
subclass of: Organisme
creator: RS
definition: sumo: Animal is an Organism "with eukaryotic Cells, and lacking stiff cell walls, plastids, and photosynthetic pigments." @en

Dier-anatomische entiteit
type: Class
subclass of: Anatomische entiteit
creator: RS
definition: AnatomicalEntity is an OrganicObject "which is generated by coordinated expression of the Animals own genes that guide its morphogenesis; has inherent 3D shape; its parts are connected and spatially related to one another in patterns determined by coordinated gene expression." Definition derived from: The Foundational Model of Anatomy Ontology (FMA). (http://purl.org/sig/ont/fma.owl) @en

Bestuursrapport
type: Class
subclass of: Rapport
creator: RS
comment: Voor de Nederlandse situatie: Bestuursrapport is de officiele benaming volgens Wetboek en maakt deel uit van wat in de praktijk 'jaarrapport' wordt genoemd, samen met de Jaarrekening. Zie: Boek 2 van het Nederlandse Burgerlijk Wetboek, Titel 9, De jaarrekening en het bestuursverslag (artikelen 360-455).
definition: Editorial: AnnualReport is a Report that describes the activities of some Organization throughout the preceding year and is intended to provide comprehensive information for interested Persons or Organizations. @en
definition: Editorial: Bestuursrapport is een Rapport waarin de activiteiten van een Organisatie worden beschreven over het afgelopen jaar en is bedoeld beknopte informatie te geven over de stand van zaken voor andere belanghebbende Personen en Organisaties.

Leerling-werknemer
type: Class
subclass of: Werknemer
creator: RS
definition: Editorial: Apprentice is the Role of a Human who works as an Employee for some Employer and receives on-the-job training and supervision while following an accompanying educational program to obtain a professional qualification. @en
definition: Editorial: Leerling-Werknemer is de Rol van een Persoon die in het kader van de Wet Educatie- en Beroepsonderwijs een Beroepsbegeleidende opleiding of een HBO-duale opleiding volgt en een Arbeidsovereenkomst heeft met een Werkgever.

Gebied of oppervlak
type: Class
subclass of: Concreet object
creator: RS
definition: Area is a PhysicalObject that is equal to some two dimensional surface. @en
example: Examples are: a parking lot, a dining area, a lake, a hemisphere, a desert, a country, etc. @en

Artefact
type: Class
subclass of: Corpusculair object
creator: RS
comment: In general, we consider all human-made PhysicalObjects to be an Artifact, where 'making' has some intentional aspect. The result of the making may be an unwanted or unsuccesful product. As such, 'intentional' does only imply that some decision preceded the making process. Note that other Artefacts such as machines can be involved in the making of another Artefact. In the definition, we deliberately stated that CognitiveAgents and not only Humans need to be involved in the making of some Artefact. This allows to include other Organisms that may or may not be considered an CognitiveAgent and capable of producing Artifacts. Also note that Objects that are the result of some autonomous biological process such as 'tears' and 'feces' are NOT considered to be Artifacts. @en
definition: Editorial: Artifact is an Object that is the result of some CreationOfArtifact and carried out by some CognitiveAgent. @en

Meet- of vaststelgebeurtenis
type: Class
subclass of: Onderzoekgebeurtenis
subclass of: Restriction
  some values from: Eigenschap of kenmerk
  on property: stelt vast
creator: RS
definition: Editorial: AssessingEvent is the subclass of InvestigationEvent where some Human evaluates, calculates or measures some Quality of an Entity. @en

Assisteren bij ADL
type: Class
subclass of: Assisteren
creator: RS
comment: For a specific set of AssistingWithDailyLivingActivities, we refer to SnoMed 'Assisting with activity of daily living' (http://purl.bioontology.org/ontology/SNOMEDCT/304560004). @en
definition: Editorial: AssistWithDailyLivingActivity is the subclass of AssistingProcess where some Human gives assistence to another Human in performing some activity associated with daily living such as 'going to the toilet', 'getting dressed'. @en
example: Examples are: 'the nurse fed the patient some apple sauce', 'he assisted her in the bathroom', 'she got him undressed for the night'. @en

BBL-Verzorgende IG niveau 3
type: Class
subclass of: Leerling-werknemer
creator: RS
definition: Editorial: AssitentNurseApprentice is the Role of a Human who works as an Employee for some CareOrganization and receives on-the-job training and supervision while following an accompanying educational program to obtain a professional qualification as AssistentNurse. @en
definition: Editorial: BBL Verzorgende IG niveau 3 is de Rol van een Persoon die in het kader van de Wet Educatie- en Beroepsonderwijs een Beroepsbegeleidende opleiding Verzorgende IG volgt en een Arbeidsovereenkomst heeft met een Zorgorganisatie.

Assisteren
type: Class
subclass of: Menselijke interactie (proces)
creator: RS
comment: We refer to SnoMed http://purl.bioontology.org/ontology/SNOMEDCT/119265000 ('Assisting') for a set of potential domain specific concepts for Helping. For onz-g, we included only the subclass AssistWithDailyLivingActivity. @en
definition: Editorial: AssistingProcess is an IntentionalProcess where some Person gives assistence to another Person in performing some task or activity. @en
example: 'helpen', 'assisteren', 'ondersteunen',
example: Examples are: 'the nurse assisted the surgeon during the operation', 'he helped the toddlers with getting dressed', 'he gave assistence to the new IT department'. @en

Auditgebeurtenis
type: Class
subclass of: Meet- of vaststelgebeurtenis
creator: RS
definition: Editorial: AuditEvent is an InvestigationEvent where some Human or GroupOfHumans carries out a methodical examination or review of some condition or situation. @en

Auditrapport
type: Class
subclass of: Rapport
creator: RS
definition: Editorial: AuditReport is a Report that describes findings, observations and conclusions after the investigation of some aspects of an Organization such as financial management or the application of quality and safety standards. @en
definition: Editorial: Auditrapport is een Rapport waarin verslag wordt gedaan van de observaties, bevindingen en conclusies van een controle van een Organisatie op een specifiek aspect zoals bijvoorbeeld financieel beheer of naleving van bepaalde kwaliteits- of veiligheidsnormen.

BRP burgerlijke staat-waarde
type: Class
subclass of: Burgerlijke staat-waarde
creator: RS
comment: Gemeentelijke Basisadministratie (GBA) is in 2015 veranderd in Basis Registratie Personen (BRP).
definition: BRPBurgerlijkeStaatWaarde representeert een waarde voor de burgerlijke staat van een Persoon zoals gedefinieerd en gebruikt in de Basis Registratie Personen (BRP) en het Centraal Bureau voor de Statistiek.

Bacterie
type: Class
subclass of: Organisme
creator: RS
definition: Editorial: Bacterium is a single celled organism that has no chlorophyll and reproduces asexually. @en

Bedhek
type: Class
subclass of: Engineering component
creator: RS
comment: De primaire functie van een Bedhek is gericht op het voorkomen van vallen; binnen de Verpleeghuiszorg kan een Bedhek overigens ook worden toegepast als een zogenoemde 'vrijheidsbeperkende maatregel'. Anders gezegd: een Stoel en een Tafel zijn beide Artefacten met een primaire functie; daarnaast kan een Tafel voor allerlei niet-primaire functies worden gebruikt zoals 'een doorgang blokkeren' en 'zitten'. In onz-g zijn Artefacten gemodelleerd volgens hun primaire functie. Aangezien 'vrijheidsbeperking' een belangrijke secundaire functie is van sommige Artefacten binnen het domein, is deze secundaire functie gemodelleerd als een Rol, meer specifiek de onz-g:FreedomRestrictionRole die als extra label kan worden meegegeven. Dus als twee patienten een bed hebben met een bedhek, dan kun je instantieren dat bij patient 1 het bedhek is geplaatst als vrijheidsbeperkende maatregel en bij patient 2 niet: 'bedhek bij patient 1' onz-g:Bedhek a EngineeringComponent hasRole FreedomRestrictionRole 'bedhek bij patient 2' onz-g:Bedhek a EngineeringComponent
definition: Editorial: BedRail is an EngineerinComponent that, if applied to some Bed, prevents that a Person falls out of Bed. @en
definition: Editorial: Bedhek is een EngineeringComponent dat, indien toegepast op een Bed, is bedoeld om te voorkomen dat een Persoon uit Bed valt.

DeclaratieOfRekening
type: Class
subclass of: Financieel informatieobject
subclass of: Restriction
  some values from: Crediteur
  on property: gaat over
subclass of: Restriction
  some values from: Debiteur
  on property: gaat over
subclass of: Restriction
  some values from: Financiële entiteit
  on property: gaat over
created: 08-23
creator: RS
definition: BillOrInvoice is the subclass of FinancialInformationObject that provides some itemized specification for the amount of money owed for e.g. provided services and/or goods. @en
definition: DeclaratieOfRekening is de subklasse van FinancieelInformatieObject waarin een specificatie wordt gegeven van een geldbedrag dat iemand verschuldigd is voor geleverde diensten en goederen of gemaakte onkosten.
example: Voorbeelden zijn: een rekening, een nota, een declaratie, een factuur.

Biologisch proces
type: Class
subclass of: Statische perdurant
creator: RS
definition: Editorial: BiologicalProcess is a Process that is embodied in some Organism. @en
example: Examples: 'breathing', 'sweating', 'thinking', 'ovulating', 'bleeding', 'digestion', 'vomiting', 'atrophy', 'calcification', etc. @en
example: Voorbeelden: 'overgeven', 'atrofie', 'zweten', 'ovuleren', 'verkalken', 'vertering', 'denken', 'ademhalen', etc.

Organische eigenschap
type: Class
subclass of: Interne eigenschap
subclass of: Restriction
  all values from: Organisme
  on property: is eigenschap of kenmerk van
creator: RS
definition: Editorial: BiologicalQuality is an InternalQuality that inheres specifically in Organisms. @en
example: Examples are 'being able to bend your knee', 'dead', 'having dementia', 'being incontinent', 'happy', 'having some pressure sore', etc. @en

Geslacht
type: Class
subclass of: Organische eigenschap
disjoint union of: Vrouwelijk geslacht
disjoint union of: Intersexe geslacht
disjoint union of: Mannelijk geslacht
creator: RS
comment: Note that most of the qualities in the ONZ ontologies follow the quality region patttern as their possible values occupy a so called value space. For the Quality onzg:BiologicalSex this value space is argued not to exist as one is either Female, Male or Intersex. Hence, these have been modeled as disjoint subclasses of BiologicalSex. @en
comment: Note that this Quality refers to the biological sex of some Organism as encoded in e.g. chromosomes and/or expressed by biological features. For the gender identity of Humans, we refer to onz-g:GenderIdentity and GenderIdentityValue. Note that some Human may have the BiologicalSex 'Male' but the GenderIdentityValue 'female'. @en
definition: BiologicalSex is a Quality that inheres in Organisms and expresses the biological sex of some Organism. @en

Organisme-eigenschapswaarde
type: Class
subclass of: Interne fysieke waarde
creator: RS
definition: Editorial: Instances of BiologicalValue indicate values for Qualities that only inhere in Organisms. @en

Biologisch-actieve substantie
type: Class
subclass of: Substantie
creator: RS
definition: sumo: BiologicallyActiveSubstance is a "Substance that can induce a change in the structure or functioning of some Organism." @en
example: Examples are: nutrients such ascorbin acid; toxic substances such as botulinum toxin; therapeutic substances. @en

Biomedisch hulpmiddel of apparaat
type: Class
subclass of: Fysiek hulpmiddel
creator: RS
relation: https://zibs.nl/wiki/MedischHulpmiddel-v4.0(2024NL)
example: Voorbeelden zijn: pleisters/gaas, beademingsapparaten, insulinepompen, catheters, sondebuisjes, stomazakken, etc.

Geboortezorg
type: Class
subclass of: Zorgdiensten
creator: RS

Beweeglijkheid van lichaam
type: Class
subclass of: Organische eigenschap
subclass of: Restriction
  all values from: Mobiliteit- en bewegingswaarde
  on property: heeft eigenschapswaarde
creator: RS
relation: https://zibs.nl/wiki/Mobiliteit-v3.3.1(2024NL)
comment: Note that we do not model any specific body motion capabilities in onz-g. Instead, we refer to existing domain-specific sources for these, such as e.g. SNOMED and the Dutch ZIB. Note that in the Dutch ZIB, a set of specific capabilities is modeled that can be considered subtypes of this class. The specific values assigned to these capabilities should be modeled as instances of onz-g:BodyMotionValue using the quality region pattern. @en
definition: Editorial: BodyMotionCapability is a BiologicalQuality that characterizes the capability of some Organism to move/translocate its body or some bodypart. @en

Mobiliteit- en bewegingswaarde
type: Class
subclass of: Organisme-eigenschapswaarde
creator: RS
relation: https://zibs.nl/wiki/Mobiliteit-v3.3.1(2024NL)
comment: For a set of shared domain concepts that express possible values for BodyMotionValue, we refer to e.g. SnoMed and ZIB. Note that the ZIB includes both abilities/capabilities that are subtypes of onz-g:BodyMotionCapability as well as values assigned to these capabilities. The latter should be modeled as instances of this class. @en
definition: Editorial: Instances of BodyMotionValue express the different physical movements that the human body can make such as 'squatting' and 'raise left arm'. @en

Lichaamspositie
type: Class
subclass of: Organische eigenschap
subclass of: Restriction
  all values from: Lichaamspositiewaarde
  on property: heeft eigenschapswaarde
creator: RS
comment: An existing value set can be reused to model the possible values of this quality. See: onz-g:BodyPositionValue for a description of values as defined in SNOMED. @en
definition: Editorial: BodyPositionQuality is a BiologicalQuality that characterizes the physical configuration that some Organism can take. @en
example: 'lichaamspositie', 'houding', 'positie', etc.

Lichaamspositiewaarde
type: Class
subclass of: Organisme-eigenschapswaarde
creator: RS
comment: For a set of shared domain concepts that express possible values for BodyPositionValue, we refer to e.g. SnoMed concept: 9851009 (Body position finding) and its subconcepts. @en
definition: Editorial: Instances of BodyPositionValue express the different physical configurations that the human body can take such as 'Fowler's position', 'supine position' and 'supported sitting'. @en

Lichaamssubstantie
type: Class
subclass of: Substantie
creator: RS
comment: Note that the FMA treats body substances such as 'liver tissue' and 'blood' as portions of substance, meaning that all subclasses in the FMA do carry Unity (+U). In onz-g, we handle all substances as -U. Hence, depending on the information need and the kind of data to be typed with the onz-g ontology, end users are advised to reuse the FMA for anatomical entities if the data are very specific for the medical domain. If not, the more coarse-grained classes for tissues and body substances can be used that are modeled in onz-g. In short, the FMA and the onz-g are not fully compatible in how substances are modeled; this needs to be considered if data labeled with FMA and onz-g were to be integrated. Also see: (http://purl.org/sig/ont/fma.owl) For notes on the FMA and the integration in onz-g, also see the comments provided for the class onz-g: HumanAnatomicalEntity. @en
definition: sumo: BodySubstance is a Substance that consists of "extracellular material and mixtures of cells and extracellular material that are produced, excreted or accreted by an Organism." @en
example: Examples are: 'saliva', 'blood', 'hormone', 'feces', 'urine', 'bone tissue', 'muscle tissue', etc. @en

Gebouw
type: Class
subclass of: Onverplaatsbaar artefact
creator: RS
definition: Editorial: Building is a constructionally independent StationaryArtifact consisting of walls, a roof and a door. @en

Bedrijf
type: Class
subclass of: Organisatie
creator: RS
definition: Editorial: Bedrijf is een Organisatie die producten en/of diensten levert in ruil voor een financiele vergoeding en daarbij een winstoogmerk heeft.
definition: Editorial: Business is an Organization that provides products and/or services in exchange for money with the aim of making a profit. @en
example: 'bedrijf', 'onderneming', 'eigen zaak', 'start-up', etc.

Calamiteitsgebeurtenis
type: Class
subclass of: Eventieve perdurant
creator: RS
comment: The extension of this class is open to change, interpretation and context while no member of the extension is necessarily a member. As such, this class has no defined subclasses or 'one of' axioms. As an example: if someone deliberately hurts himself, this event can be labeled as a onz-g:SelfHarmEvent. In case that this event is also considered a calamity that should be reported to authorities, one can apply an additional label 'CalamityEvent'. Alternatively, one can opt to label as 'CalamityEvent' only, while leaving out the specification of the more precise nature of the event (e.g. self-harm, a sexual assault, etc). Also note that onz-g allows for applying case roles for the participants of some events that can be used as labels for e.g. the 'agent' and the 'patient' of the event. As such, one can specify if: - a PatientInCare (agent) sexually assaulted some Caregiver (patient); - a PatientInCare (agent) sexually assaulted another PatientInCare (patient) or; - a CareGiver (agent) assaulted some PatientIncare (patient). Also see onz-g:Participant and its subclasses for more explanation and some examples. @en
definition: Calamiteit is een niet-beoogde of onverwachte gebeurtenis, die betrekking heeft op de kwaliteit van de zorg en die tot de dood van of een ernstig schadelijk gevolg voor een cliënt heeft geleid. (Definitie 'calamiteit' uit: Wet Kwaliteit, Klachten en Geschillen Zorg)
definition: Editorial: CalamityEvent is an unintended and unexpected event related to quality of care and that resulted in the death of some PatientInCare or severe injuries/complications/trauma. (Loosely translated definition of: 'calamiteit' in: "Wet Kwaliteit, Klachten en Geschillen Zorg" or Dutch legislation on Quality of Care and Complaints & Disputes.) @en

Capaciteit
type: Class
subclass of: Kwantitatief-meetbare eigenschap
subclass of: Restriction
  all values from: Capaciteitswaarde
  on property: heeft eigenschapswaarde
creator: RS
comment: Note that this Quality is NOT for modeling 'human capacities' in the sense of the ability to learn and retain knowledge and skills.
definition: CapacityQuality is a QuantitativeMeasurementQuality that characterizes the amount of some PhysicalEndurant that some other PhysicalEndurant can potentially hold, contain or incorporate. @en
example: This barrel has a capacity of 100 liter; this bag can hold 20 kilo; this nursing home can provide care for 100 patients; the hotel can accomodate 50 tourists; the elevator has a maximum capacity of seven persons, etc. @en

Capaciteitswaarde
type: Class
subclass of: Kwantificeerbare meetwaarde
subclass of: Restriction
  all values from: Concrete endurant
  on property: heeft capaciteitsobject
creator: RS
comment: Note that CapacityValues can pick up different UnitOfMeasures such as UnitOfVolume, UnitOfMass, etc. Also note that the hasCapacityObject axiom can be used to specify what the PhysicalEndurant is that can be held/contained by some other PhysicalEndurant. This can be of use in case data needs to be modeled for which volumic mass density and the conversion between volume and mass is required. As such, in the case that: "some barrel has a capacity of 100 kilo apples", then: CapacityValue hasCapacityObject 'apples' CapacityValue hasUnitOfMeasure 'kilo' (UnitOfMass) "some barrel has a capacity of 17 apples", then: CapacityValue hasCapacityObject 'apples' and no UnitOfMeasure. @en
definition: Instances of CapacityValue express what quantity of some PhysicalEndurant can potentially be contained/held or incorporated by some other PhysicalEndurant. @en
example: Examples: This barrel can contain 10 kilo pet food/12 liter water/17 apples/"a lot"; This hotel can accomodate 200 guests; You can store 4Gb of data on this USB device. @en

Koolhydraat
type: Class
subclass of: Voedingsstof
creator: RS
definition: Editorial: Carbohydrate is a Nutrient that consists of organic compounds and can be broken down by some Organism to release energy for the biological functions of that Organism. @en

Elementair lichaamsdeel
type: Class
subclass of: Menselijke anatomische entiteit
creator: RS
definition source: http://purl.org/sig/ont/fma/fma7153
definition: FMA: "Anatomical structure, each instance of which has as its constitutional part some subdivision of the skeleton, and some subdivision of integument, such that the meronymic sum of an individual’s cardinal body parts constitutes the individual’s entire body. Examples: head, limb" @en

Elementair orgaandeel
type: Class
subclass of: Menselijke anatomische entiteit
creator: RS
definition source: http://purl.org/sig/ont/fma/fma82472
definition: FMA: "Anatomical structure, each instance of which has as its direct parts some instance of portions of two or more types of tissue and is continuous with some instance of one or more anatomical structures, likewise constituted by some portions of two or more tissues distinct from those of their complement." @en

Zorg-administratief informatieobject
type: Class
subclass of: Administratief informatieobject
creator: RS @en
comment: Note that subclasses of this class may not by definition represent concepts but also administrative constructs that are merely needed to label administrative data. @en
definition: CareAdministrativeInformationObject is an AdministrativeInformationObject that expresses (uniformized) conceptions as they function specifically and exclusively in the administrative realm for the care domain. @en
example: Specifiek Nederlandse voorbeelden zijn: 'grondslag zorg', 'leveringsvorm', etc.

Zorgorganisatie
type: Class
subclass of: Bedrijf
creator: RS
modified: 27-10-2022
relation: https://zibs.nl/wiki/Zorgaanbieder-v3.6(2024NL)
comment: Note that this class and all its subclasses inherit from onz-g:Organization and onz-g:Collection. For the building(s) in which some Organization can reside and that may be associated with an address, we refer to onz-g:AccomodativeObject. As an example: 1.) a Hospital can be on fire in which case one refers to onz-g:AccomodativeObject/onz-g:StationaryArtifact, and; 2.) a Hospital may go bankrupt in which case one refers to onz-g:Hospital/onz-g:Organization. @en
change note: CareOrganization was a sibling class of Business in onzg 2.0.0 and has been changed into the subclass of Business for onzg version 2.1.0. @en
definition: Editorial: CareOrganization is an Organization whose primary purpose is to provide some form of care and/or cure for Humans. @en
definition: Editorial: ZorgOrganisatie is een Organisatie die als primair doel heeft om een vorm van zorg en/of ondersteuning te verlenen aan Personen.

Zorgverlener
type: Class
subclass of: Sociale rol
creator: RS
relation: https://zibs.nl/wiki/Zorgverlener-v4.0(2024NL)
definition: Editorial: Caregiver is the Role of a Human or Organization who provides medical care to other Humans. @en
definition: Editorial: Zorgverlener is de Rol van een Persoon (of Organisatie) die een vorm van verzorging en/of medische zorg verleent aan patienten of clienten.

Semantische rol
type: Class
subclass of: Participant
subclass of: Restriction
  some values from: Perdurant
  on property: is semantische rol participant in
creator: RS
comment: Note that the use of case roles is fully optional but allows for finegrained data retrieval on event participants. Our definition of case roles follows the theory of the linguist Charles Fillmore. In short, case roles describe what role some entity plays in an event, e.g. if it is doing something, undergoing something or using something. In this ontology, we use case role as a specification of the general role Participant. For example, in the sentence 'Mary hit John with vase', we have three participants: Mary, John and a vase. With case roles, you can specify the semantic role of the participants: 'Mary' is the Agent, 'John' the Patient and 'the vase' the Theme. Having case roles for participants of an event allows for specific queries that ask for e.g. all persons participating in some reported agressive incident in the role of AgentCaseRole or PatientCaseRole. In other words: ultimately it allows to specify whether a) some PatientInCare hit a Caregiver or b.) some Caregiver hit a PatientIncare or c) some PatientInCare hit another PatientInCare. Also see: Fillmore, Charles J. (April 1967). "The case for case". Proceedings of the Texas Symposium, on Language Universals. For a fine-grained implementation of case roles, see FrameNet: https://framenet.icsi.berkeley.edu/fndrupal/. @en
definition: Editorial: CaseRoles are semantic roles played by participants of an event, process or situation. @en

Lichaamscel
type: Class
subclass of: Menselijke anatomische entiteit
creator: RS
definition source: http://purl.org/sig/ont/fma/fma68646
definition: FMA: "Anatomical structure, each instance of which has as its boundary the external surface of some maximally connected plasma membrane. Examples: lymphocyte, fibroblast, erythrocyte, neuron." @en

Fysiek certificaat
type: Class
subclass of: Fysiek document
creator: RS
comment: Examples are: receipts, testaments, bonds, insurance policies, passports and drivers licenses. @en
definition: Editorial: Certificaat is een Object waarin een schriftelijke en ondertekende verklaring staat opgesteld dat als bewijsstuk dient voor de feiten die in de verklaring staan vermeld.
definition: Editorial: Certificate is a ContentBearingObject that contains a written statement and that serves as evidence for the facts that make up the statement. @en

Verandering van eigendom of bezit-gebeurtenis
type: Class
subclass of: Menselijke interactie-gebeurtenis
creator: RS
definition: Editorial: ChangeOfPossession is the subclass of SocialInteractionEvent where some Entity changes of ownership between two Agents or where the usage of some Entity is temporarily transferred between Agents. @en
example: Examples are: give.v, take.v, lease.v, transaction.n, investment.n, buy.v, export.v, rent.v. loan.v, sell.v, etc. @en

Chemische substantie
type: Class
subclass of: Substantie
creator: RS
definition: Editorial: ChemicalSubstance is a Substance that has a constant chemical composition and persistent characteristic properties.
example: Examples are: water, oxygen, calcium, uranium, alcohol, urea, titanium, lithium, etc. @en

Kind van een ouder
type: Class
subclass of: Verwante of familielid
creator: RS
comment: Note that this role is NOT intended for humans that have an age that is considered to be in the range of being a child. @en
definition: Editorial: ChildOfParent is the Role of some Human and corresponds to the relation someone has as a descendent of some Parent. @en

Burgerlijke staat
type: Class
subclass of: Relationele eigenschap
subclass of: Restriction
  some values from: Burgerlijke staat-waarde
  on property: heeft eigenschapswaarde
subclass of: Restriction
  all values from: Mens
  on property: is eigenschap of kenmerk van
creator: RS
relation: https://zibs.nl/wiki/BurgerlijkeStaat-v3.2(2024NL)
definition: Editorial: CivilStatus is a RelationalQuality that inheres in Humans and characterizes the existence or non-existence of some (formal) relationship to another Human, e.g. according to some law or societal customs. @en

Burgerlijke staat-waarde
type: Class
subclass of: Relationele fysieke waarde
creator: RS
relation: https://zibs.nl/wiki/BurgerlijkeStaat-v3.2(2024NL)
definition: Instances of CivilStatusValue express the values that can be used to indicate the civil status of some Human such as 'married', 'divorced' and 'widowed'. @en

Classificatiesysteem
type: Class
subclass of: Abstract informatieobject
creator: RS
definition: Editorial: Instances of ClassificationSystem are descriptive structures that provide some shared organization and definition of levels or degrees of some phenomenon that exists or is recognized in some domain. @en
example: Examples: the 'European Classifications Framework' and the 'Quetelet Index'. @en

Medezeggenschapsorganisatie
type: Class
subclass of: Organisatie
creator: RS
definition: Editorial: CoDeterminationOrganization is an Organization that consist of Persons who consult on topics and issues regarding some aspects of the managment of the Organization that the CoDeterminationOrganization is part of or affiliated with. @en

Codelijst
type: Class
subclass of: Lijst
subclass of: Restriction
  some values from: Identifier-informatieobject
  on property: heeft deel
creator: RS
definition: CodeList is the subclass of List that consists of IndentifierInformationObjects organized according to some principle where the IdentifierInformationObject itself is a standardized and opaque referrent to some thing in the world. @en
example: Examples include: 'COD-163-CIZ', 'COD016-VEKT', etc. @en

Cognitieve agens
type: Class
subclass of: Agens
creator: RS
definition: sumo:"A CognitiveAgent is an Agent that has the ability to reason, deliberate, make plans, and experience emotions". @en

Cognitief proces
type: Class
subclass of: Intentioneel proces
creator: RS
definition: Editorial: CognitiveProcess is an IntentionalProcess where some CognitiveAgent intentionally realizes some mind-internal Process such as 'thinking' and 'imagining'. @en
example: Examples are: 'think', 'compare', 'analyse', 'interpret', 'learning', 'reason', etc. @en

Samenwerken
type: Class
subclass of: Menselijke interactie (proces)
creator: RS
comment: For mergers between Organizations that result in a new Organization, we refer to onz-g:OrganizationalMergingEvent. For processes that refer to one CognitveAgent primarily helping out another CognitiveAgent in carrying out some task, we refer to onz-g:AssistingProcess. @en
definition: Editorial: CollaborationProcess is an IntentionalProcess where two or more CognitiveAgents work together with the intention to achieve some shared goal. @en
example: 'samenwerken', 'samenwerking', 'meewerken', etc.
example: Examples are: 'The companies worked together on the development of a vaccine', 'They partnered in the lease of a car', 'The results were achieved in close collaboration with the IT department'. @en

Groep of collectie
type: Class
subclass of: Concreet object
creator: RS
comment: Collection carries Unity (+U). @en
comment: Note that Collections can have other Collections as parts; an organization may consist of several departments or subdivisions that also are a Collection, while it has Humans as members. @en
definition: Editorial: Collection is an Object that consists of members. @en
example: Examples: archipelago, flock of sheep, military convoy, musical group, football team, forest, video surveillance system. @en

Collectieve arbeidsovereenkomst
type: Class
subclass of: Overeenkomst
creator: RS
definition: Editorial: CollectiveLabourAgreement is the subclass of Agreement that describes the rules, regulations and obligations for Employers and Employees within the context of some employment. @en

Communiceren
type: Class
subclass of: Menselijke interactie (proces)
creator: RS
comment: Note that 'transmission' in our definition should not be confused with expressions such as 'sending a letter/email to someone' which are instances of onz-g:Giving. @en
comment: Note that sounds that e.g. Humans can make without a direct and intended communicative purpose, such as Singing, Laughing and Screaming are NOT subclasses og CommunicationProcess for this reason. For future extensions, these could be added in the following hierarchy: Vocalizing/RadiatingSound/MotionProcess/StativePerdurant. @en
comment: Note the difference with onz-g:ContentDevelopment that points to events where some onz-g:ContentBearingObject (a book, a mail, a dossier, a painting) is created with the intention to transmit some message or information (a onz-g:InformationObject). In other words: if you say 'trees are beautiful' then your actual saying something is an instance of onz-g:CommunicationProcess while your utterance 'trees are beautiful' would be an instance of onz-g:InformationObject in this context. Likewise, if you write a letter that says 'trees are beautiful', then your writing is an instance of onz-g:ContentDevelopment; the letter is an instance of onz-g:ContentBearingObject while your statement 'trees are beautiful' will be an instance of onz-g:InformationObject in this context. Note the emphasis on 'in this context' in our illustration as someones opinion/belief/conceptualization/idea that 'trees are beautiful' would be an instance of onz-g:Description! @en
comment: We refer to onz-g:DiseaseOrSyndrome for communication-related disorders such as 'echolalia', 'aphasia' and 'schizophasia'. @en
definition: Editorial: CommunicatingProcess is a SocialInteractionProcess where information is transmitted between two or more CognitiveAgents. @en
example: 'communiceren', 'opbellen', 'vertellen', 'aanwijzen', 'nee knikken', 'verzoeken', 'vragen stellen', etc.
example: Examples: 'he gave her a call', 'she nodded her head in agreement', 'he spoke with a soft voice', 'he ordered three pancakes', 'she declared her love for him', 'he asked for more help', 'she elaborated on the matter', 'the witness pointed at the defendant', etc. @en

Samengestelde meeteenheid
type: Class
subclass of: Meeteenheid
creator: RS
definition: SUMO: Instances of this Class are UnitsOfMeasure defined by the functional composition of other units, each of which might be a CompositeUnitOfMeasure or a NonCompositeUnitOfMeasure. @en

Contactpersoon
type: Class
subclass of: Sociale rol
creator: RS
relation: https://zibs.nl/wiki/Contactpersoon-v4.1(2024NL)
definition: Editorial: ContactPerson is the role of some Human where someone is designated to act as a representative of some other Human in order to receive or provide personal information about this other Human. @en

Informatiedragend artefact
type: Class
subclass of: Artefact
subclass of: Restriction
  some values from: Abstract informatieobject
  on property: draagt
creator: RS
comment: Note the difference between ContentBearingObject and InformationObject: - the 'Iliad' is one InformationObject and can be represented in multiple ContentBearingObjects (e.g. multiple books). - ContentBearingObjects can be thrown and set on fire, but InformationObject can not. In Natural Language, it is often unclear if one refers to the object or the content that it bears. When in doubt on what class to instantiate, we advise to check whether the focus is on the content/information or on the object. Also note that onz-g has two object properties to define the relation between ContentBearingObject and InformationObject: onz-g:bears and onz-g:borneBy. @en
definition: Editorial: ContentBearingObject is an Artifact that carries some InformationObject. @en
example: Examples are: drivers licenses, traffic signs, books, photographs, a newspaper, a painting. @en

Contentontwikkelingsgebeurtenis
type: Class
subclass of: Creatie van artefact gebeurtenis
creator: RS
comment: We refer to onz-g:CommunicatingProcess for a detailed illustration and explanation on how classes related to 'communication' in its broadest sense are modeled in onz-g. As an overview, we provide the following main classes pertaining to communication: onz-g:ContentBearingObject onz-g:ContentDevelopment onz-g:CommunicationProcess onz-g:InformationObject onz-g:Description @en
definition: Editorial: ContentDevelopment is the subclass of CreationOfArtifact where some ContentBearingObject is created. @en
example: Examples are: 'photograph.v', 'registration.n', 'write.v', 'code.v'. @en

Fysiek contract
type: Class
subclass of: Fysiek document
creator: RS
definition: Editorial: Contract is a type of Document that describes a legally enforcable, negotiated agreement between parties as to some situation or action. @en

Corpusculair object
type: Class
subclass of: Concreet object
subclass of: Restriction
  all values from: Corpusculair object
  on property: heeft objectlocatie
creator: RS
definition: sumo: CorpuscularObject is a PhysicalObject "whose parts have properties that are not shared by the whole."
example: Examples are: 'tree', 'table', 'building', 'syringe'. @en

Land
type: Class
subclass of: Geopolitiek gebied
creator: RS
definition: Editorial: Country is a GeopoliticalArea that covers the area governed by some national government. @en

Creatie van artefact gebeurtenis
type: Class
subclass of: Intentionele gebeurtenis
creator: RS
comment: Note that this class is intended for events that lead to the creation of Artifacts (e.g. 'building a house', 'register a patient'), not for the manipulation of Substances, Artifacts or PhysicalObjects (e.g. 'painting a door', 'kneading dough'). Also note that we make no formal claims to whether or not some Artifact is actually produced as result of some CreationOfArtifact. However, all Artifacts must be the result of some CreationOfArtifact. @en
definition: Editorial: CreationOfArtifact is an IntentionalEvent where some CognitiveAgent creates some Artifact. @en
example: Examples are: 'writing.v', 'building.v', 'manufacture.v', 'creation.n', 'cook.v', 'produce.v'. @en

Crediteur
type: Class
subclass of: Relationele rol
subclass of: Restriction
  some values from: Class
    union of: Mens
    union of: Organisatie
  on property: is rol gedragen door
created: 08-23
creator: RS
definition: Creditor is the Role of a Human or Organization that receives some amount of money from a Debtor for the delivery of goods and/or services. @en
definition: Een Crediteur is de rol van een Persoon of Organisatie die een geldbedrag ontvangt van een Debiteur vanwege geleverde diensten en/of goederen danwel door de Crediteur gemaakte onkosten.

CureAndCareIdentificationCode
type: Class
subclass of: Formele identifier
created: 08-23
creator: RS
definition: CureAndCareIdentificationCode is the subclass of FormalIdentifier and denotes all identification codes issued by some authority that identify services, treatments etc within the Dutch Cure and Care domain, and that serve primarily in the realm of calculating tariffs and invoices for patients and healthcare insurance companies. @en
definition: Voorbeelden: "zorgprestatiecode", "DBC", etc.

Zorgdiensten
type: Class
subclass of: Service- Of Dienstverlening
creator: RS
definition: CureAndCareProcess is the subclass of ServiceProcess and denotes all services, actions and processes associated with Cure and Care. @en

ZorgTarief
type: Class
subclass of: Tarief
created: 08-23
creator: RS
comment: "Zorgverzekeraars en zorgkantoren leggen in contracten met zorgaanbieders vast welke zorg er geleverd wordt, tegen welke kwaliteit en welk tarief. De NZa helpt hieraan mee door omschrijvingen van de behandelingen (prestaties) vast te stellen. Voor bepaalde behandelingen gelden maximumtarieven. Dit betekent dat de tarieven dan wel lager, maar niet hoger mogen zijn dan dat maximum. De NZa stelt deze maximumtarieven vast op basis van periodiek kostenonderzoek. In een aantal sectoren gelden vrije tarieven: in de gehele paramedische zorg, het grootste deel van de medisch-specialistische zorg en een deel van de huisartsenzorg." Bron: https://www.nza.nl/over-de-nza.
definition: ZorgTarief is een (genormaliseerde en/of gestandaardiseerde) geldelijke vergoeding voor een geleverde zorgdienst, zorghandeling of -product volgens een bepaalde eenheid van levering.

Beschadigen
type: Class
subclass of: Interne verandering
creator: RS
comment: Note that some damaging event will result in some situation or state of 'damagedness' that can be time-indexed with a beginning and sometimes and end (also called a Situation, see: gUFO:Situation). For now however, we consider to model 'damagedness', not as Situations or States but as a Quality that inheres in some Entity. Situations where some quality exists for some time period may be instantiated in a later phase, depending on information need, availability of data and more specific requirements. See also: onz-g:Situation and the explanation provided for this class. @en
definition: Editorial: DamagingEvent is an InternalChange where some Agent or cause induces a situation where some entity no longer functions/develops normally or as intended. @en
example: Examples: 'the rock broke the wind shield of their car' ; 'The cat dented the fresh concrete floor'; 'The dictator damaged the peace process with his remarks' (metaphorical use). @en

Dood
type: Class
subclass of: Levend of dood-eigenschap
creator: RS
definition: Editorial: Dead is the AnimacyQuality that characterizes that some Organism is dead. @en

Debiteur
type: Class
subclass of: Relationele rol
subclass of: Restriction
  some values from: Class
    union of: Mens
    union of: Organisatie
  on property: is rol gedragen door
created: 08-23
creator: Debtor is the Role of a Human or Organization that owes some amount of money to a Creditor for receiving goods and/or services. @en
creator: RS
definition: Een Debiteur is de rol van een Persoon of Organisatie die een geldbedrag schuldig is aan een Crediteur vanwege ontvangen diensten en/of goederen danwel door de Crediteur gemaakte onkosten.

Afnemen
type: Class
subclass of: Verandering in hoeveelheid
creator: RS
definition: DecreasingEvent is the subclass of QuantityChangeEvent where the quantity of some Entity becomes less. @en
example: 'afname', 'inkrimpen', 'verminderen', 'dalen', 'krimp', etc.
example: Examples: 'the stock value dropped significantly', 'he cut down on his alcohol intake', 'the nurse reduced the administrative effort', 'the population declines'. @en

Mondhygiënist
type: Class
subclass of: Zorgprofessional
creator: RS
definition: Editorial: DentalHygienist is the HealthcareProfessionRole of a Human who carries out preventive and small restorative actions to maintain oral health in Humans. @en

Tandarts
type: Class
subclass of: Zorgprofessional
creator: RS
definition: Editorial: Dentist is the HealthcareProfessionRole of a Human who is specialized in the diagnosis, prevention, and treatment of diseases and conditions of the oral cavity. @en

Onzelfstandig vertrek of ruimte
type: Class
subclass of: Onverplaatsbaar artefact
subclass of: Restriction
  some values from: Onverplaatsbaar artefact
  on property: deel van
creator: RS
definition: DependentStationaryArtifact is a StationaryArtifact with a fixed spatial location that is structurally dependent on some other StationaryArtifact. @en
example: Examples: a room, the left wing of some building, a hallway, etc. @en
example: Voorbeelden: vleugel, verdieping, kamer, hal, etc.

Diepte
type: Class
subclass of: Kwantitatief-meetbare eigenschap
subclass of: Restriction
  all values from: Dieptewaarde
  on property: heeft eigenschapswaarde
creator: RS
definition: Editorial: DepthQuality is a QuantitativeMeasurementQuality that characterizes the distance between the some point of a PhysicalObject and another point of a PhysicalObject that is beneath the first point. @en
example: Examples include: "the depth of a cut in your finger", "the depth of a crater", etc. @en

Dieptewaarde
type: Class
subclass of: Kwantificeerbare meetwaarde
creator: RS
definition: Editorial: Instances of DepthValue express the quantity values of the physical quality Depth. @en

Descriptie
type: Class
subclass of: Niet-fysieke endurant
creator: RS
definition source: http://www.loa-cnr.it/ontologies/ExtendedDnS.owl#description
definition: dolce: A Description is a NonPhysicalEndurant that "represents a conceptualization (e.g. a mental object or state), hence it is generically dependent on some agent and communicable. Descriptions define or use concepts or figures, are expressed by an information object and can be satisfied by situations." @en
example: an idea, a concept, the mental object that time is money, etc. @en

Vernietigen
type: Class
subclass of: Interne verandering
creator: RS
comment: For Organisms that are destroyed/die/die off as a whole, we refer to onz-g:DyingProcess.
definition: Editorial: DestructionEvent is an InternalChange where some Agent or cause induces a situation where some Object (e.g. a house, some bodypart, an appliance) ceases to exist or is no longer functional. @en
example: 'verwoesten', 'vernietiging', 'afsterven', 'destructie', 'uitroeien', 'slopen', 'stukmaken', etc.
example: Examples: 'the nursing home will be demolished', 'please destroy the needles after use', 'the procedure destroyed his bone marrow', 'this policy destroys everything we worked for' (metaphorical use), 'his foot is dying off'. @en

Fysiek hulpmiddel
type: Class
subclass of: Artefact
creator: RS
comment: onz-g:Device laat zich niet goed naar het Nederlands vertalen; bedoeld zijn alle artefacten, dus concrete en mensgemaakte objecten, die dienen als instrument bij een Proces of Acitiviteit. Voorbeelden zijn: meetlint, infuus, televisie, ambulance, rits, Zweedse band, scalpel, etc. Objecten zoals 'zitbank' en 'plooirok' die een functie hebben bij een 'staat', zoals 'zitten' en 'gekleed zijn', worden NIET beschouwd als Device.
definition: Editorial: Device is an Artifact that is intended to serve as an instrument in some Event or Process. @en
definition: Editorial: FysiekHulpmiddel is een Artefact dat is bedoeld om als instrument te dienen bij een zeker Proces of Activiteit.

Technisch systeem
type: Class
subclass of: Variabele groep of collectie
creator: RS
definition: Editorial: DeviceSystem is a VariableCollection that consists of a collection of Devices that are interconnected or work together to bring about some result or assist with some task. @en
example: Examples are: 'video surveillence system', 'fire prevention system'. @en

Diagnostiseergebeurtenis
type: Class
subclass of: Meet- of vaststelgebeurtenis
creator: RS
comment: Note that DiagnosisInvestigativeEvent is NOT a subclass of SocialInteraction since instances of DiagnosisInvestigativeEvent do not necessarily involve direct interaction with another Person but may involve investigating only ContentBearingObjects such as ECG's, test reports, etc. Also note that DiagnosisInvestigativeEvent is NOT a subclass of TherapeuticIntervention since instances of the latter concern all therapeutic actions carried out to stabilize or alleviate some DiseaseOrSyndrome. DiagnosisInvestigativeEvents do not stabilize or alleviate some DiseaseOrSyndrom but are carried out to gather information whether or not some DiseaseOrSyndrom inheres in some Person. @en
definition: DiagnosisInvestigativeEvent is an InvestigationEvent where some Person with the authority and credentials to do so investigates another Person and/or ContentBearingObjects associated to that Person in order to discern what DiseaseOrSyndrome inheres in this Person. @en
example: 'diagnostiseren', 'een diagnose stellen',

Diameter
type: Class
subclass of: Lengte
creator: RS
definition: Editorial: DiameterQuality is a LengthQuality that characterizes the linear extent in space of some circular-shaped PhysicalObject. @en

Dieetvoedingsartefact
type: Class
subclass of: Bewerkt voedingsartefact
creator: RS
definition: Editorial: DietFoodArtifact is a PreparedFoodArtifact that is intended to be ingested by some Human in the context of preventing, alleviating or reducing the progression of some disease or syndrome. @en

Diëtist
type: Class
subclass of: Zorgprofessional
creator: RS
label: Voedingsdeskundige
definition: Editorial: Dietician is the HealthcareProfessionRole of a Human who assesses, diagnoses, and treats nutritional problems in Humans. @en

Diploma
type: Class
subclass of: Fysiek certificaat
creator: RS
definition: Wikipedia: Diploma is a Certificate issued by an educational institution, such as college or university, that testifies that the recipient has successfully completed a particular course of study. @en

Disability
type: Class
subclass of: Ziekte of syndroom
creator: RS

Concreet hulpmiddel bij een fysieke beperking
type: Class
subclass of: Fysiek hulpmiddel
creator: RS
relation: https://zibs.nl/wiki/MedischHulpmiddel-v4.0(2024NL)
comment: Note that e.g. Wheelchair and MobilityScooter are subclasses of onz-g:Vehicle as these Devices do not assist but replace human physical movement. @en
definition: Editorial: DisabilityAssistiveDevice is a Device that is designed to assist a Person with a functional disability and/or helps the Person taking care of this Person with carrying out activities of daily living such as personal care, eating, drinking and toiletting. @en

Ziekte of syndroom
type: Class
subclass of: Organische eigenschap
creator: RS
relation: https://zibs.nl/wiki/AandoeningOfGesteldheid-v1.0(2024NL)
comment: Note that specific types of diseases and conditions such as 'malaria', 'HIV', 'Marburg disease', 'SARS', etcetera are NOT subclasses of DiseaseOrSyndrome but instances of this class! This class can be further extended for different diseases (e.g. bacterial/viral), disabilities, and syndromes. Alternatively, one may opt to reuse the Disease Ontology (https://disease-ontology.org/). This ontology also contains cross-references to e.g. SNOMED for interoperability. The top node of the Disease Ontology aligns with onz-g:DiseaseOrSyndrome. The Disease Ontology is available as open source here: https://github.com/DiseaseOntology/HumanDiseaseOntology/tree/main/src/ontology @en
comment: The condition called 'decubitus' in Dutch is added as an Individual and denotes the condition of having one or multiple pressure sores. For the actual lesions that have some classification of severity and some location on the human body, we refer to onz-g:PressureUlcer. @en
definition: DiseaseOrSyndrome is a BiologicalQuality which (sumo) "qualifies something that alters or interferes with a normal process, state or activity of an Organism. It is usually characterized by the abnormal functioning of one or more of that Organisms systems, parts, or organs." @en

Fysiek document
type: Class
subclass of: Informatiedragend artefact
creator: RS
comment: Note that instances of Document can be physical or electronical objects. @en
definition: Editorial: Document is a ContentBearingObject that carries some textual InformationObject of a relatively small size. @en

Verwijsbrief
type: Class
subclass of: Fysiek certificaat
creator: RS
definition: Editorial: DocumentOfMedicalReferral is a physical or digital Document that describes the officiel request from one CareGiver to another CareGiver to take over the care for some Person and usually includes a description of the medical situation of this Person. @en
definition: Editorial: Verwijsbrief is een fysiek of digitaal Document waarin een Zorgverlener een officieel verzoek doet aan een andere Zorgverlener om de zorg en/of behandeling van een Persoon over te nemen. Verwijsbrief bevat doorgaans ook een beschrijving van de medische situatie van een Persoon.

Tijdsduurwaarde
type: Class
subclass of: Duur- en tijdswaarde
subclass of: Class
  union of: Restriction
    all values from: Tijdsduureenheid
    on property: heeft meeteenheid
  union of: Restriction
    has value: Procent
    on property: heeft meeteenheid
creator: MN
definition: Instanties van DurationValue drukken een hoeveelheid tijd uit van één of meerdere gebeurtenissen, binnen een bepaald interval. Het interval wordt aangegeven met een start- en eindmoment.
editorial note: DurationValue wijkt af van IntervalValue omdat het de tijd uitdrukt die is verstreken van (een) bepaalde gebeurtenis(sen) bínnen een interval. Als een bepaalde gebeurtenis iedere maand gedurende 1 etmaal plaatsvindt, is de IntervalValue 1 jaar, maar de DurationValue voor deze gebeurtenis 12 x 24 uur.

Opleidingsclassificatiesysteem
type: Class
subclass of: Classificatiesysteem
creator: RS
definition: Editorial: Instances of EducationClassificationSystem are descriptive structures that provide some shared organization and definition of the educational levels that exist in some domain. @en
example: An example instance of this class is the European Classifications Framework. @en

Opleidingsplan
type: Class
subclass of: Maatschappelijk informatieobject
creator: RS
definition: Editorial: EducationPlan is a SocialInformationObject where some Organization states what professional courses and training will be offered to Employees in order to maintain or improve the educational level and profiency of the Organization @en
definition: Editorial: Opleidingsplan is een Plan waarbij een Organisatie inventariseert en beschrijft wanneer en welke opleidingen en cursussen worden aangeboden aan leden van de Organisatie met als doel het kennisniveau van de Organisatie op peil te houden of verder uit te breiden.
example: Voorbeelden: een opleidingsplan, een scholingsplan, etc.

Opleidingsniveau
type: Class
subclass of: Kwalificatieniveau
subclass of: Restriction
  all values from: Opleidingsniveau-waarde
  on property: heeft eigenschapswaarde
creator: RS
definition: EducationalLevelQuality characterizes the level of education/professional training received by some Human. @en

Opleidingsniveau-waarde
type: Class
subclass of: Kwalificatieniveau-waarde
creator: RS
comment: Educational Level values are usually assigned via some shared classification system. Note however that the ontology does not make a commitment on this point; the model is open to all values that refer to some EducationalLevelValue. @en
definition: Editorial: Instances of EducationalLevelValue express values for the level of education of some CognitiveAgent. @en

Werknemer
type: Class
subclass of: Werker
creator: RS
definition: Editorial: Employee is the Role of a Human who works for another Person or Organization and is compensated financially for this labour while the rights and responsibilies are defined in an EmploymentContract. @en
definition: Editorial: Werknemer is de Rol van een Persoon die arbeid verricht voor een ander Persoon of Organisatie in ruil voor een financiële compensatie en waarbij de onderlinge afspraken, rechten en plichten zijn vastgelegd in een Arbeidscontract.

Werknemersidentifier
type: Class
subclass of: Identifier-informatieobject
creator: RS
definition: Editorial: EmployeeIdentifier is an IdentifierInformationObject that is used to identify some Employee within some situation or context. @en

Werkgever
type: Class
subclass of: Relationele rol
creator: RS
definition: Editorial: Employer is the Role of a Human or Organization who provides labour to another Person and gives a financial compensation for this labour while the mutual rights and responsibilies are defined in an EmploymentContract. @en
definition: Editorial: Wergver is de Rol van een Persoon of een Organisatie die werk verschaft aan een Persoon en daarvoor financiele compensatie geeft waarbij de onderlinge rechten en plichten zijn vastgelegd in een Arbeidscontract.

Uitzendbureau
type: Class
subclass of: Bedrijf
creator: RS
broad match: http://www.ontologyportal.org/translations/SUMO.owl.txt#Agency
definition: Editorial: EmploymentAgency is a Business that mediates between Persons looking for a (temporary) job and Businesses and Organizations that need Persons to carry out some task. @en
definition: Editorial: Uitzendbureau is een Bedrijf dat bemiddelt tussen Personen die (tijdelijk) werk zoeken en Bedrijven en Organisaties die Personen nodig hebben voor het uitvoeren van bepaalde werkzaamheden of een specifieke taak.
example: 'uitzendbureau', 'uitzendorganisatie'

Endurant
type: Class
subclass of: TijdEnPlaatsGebondenEntiteit
subclass of: Restriction
  all values from: Perdurant
  on property: is participant in
creator: RS
definition: dolce: The main characteristic of endurants is that all of them are independent essential wholes. This does not mean that the corresponding property (being an endurant) carries proper unity, since there is no common unity criterion for endurants. Endurants can 'genuinely' change in time, in the sense that the very same endurant as a whole can have incompatible properties at different times. To see this, suppose that an endurant - say 'this paper' - has a property at a time t 'it's white', and a different, incompatible property at time t' 'it's yellow': in both cases we refer to the whole object, without picking up any particular part of it. Within endurants, we distinguish between physical and non-physical endurants, according to whether they have direct spatial qualities. @en

Engineering component
type: Class
subclass of: Artefact
creator: RS
comment: For this version of the ontology, we do not further extend this class with an elaborated hierarchy. The few subclasses currently defined, consist of the concepts necessary for patient safety and quality of care in Dutch Nursing Homes. @en
comment: The difference between Device and EngineeringComponent is that instances of EngineeringComponent can not function or have a limited functionality if not applied to some Device. For instance, a wheel will not function unless applied to some bike or car. In other words: EngineeringComponents make up a Device. Note however, that some Devices may consist of other Devices and can considered to be a onz-g:Collection (e.g. a sprinkler system or a video surveillance system). Also, some Devices may not have any EngineeringComponents but consist of parts (e.g. a comb or a spoon). Also note that instances of EngineeringComponent have their own Identity and Unity criteria (+I, +U), meaning that substances (-U) should and can NOT be modeled as EngineeringComponent. For substances like 'gold', 'clay' and 'water', we refer to onz-g:Substance. @en
definition: Editorial: EngineeringComponent is an Artifact that serves as a component of some Device. @en
definition: Editorial: EngineeringComponent is een Artefact dat gebruikt wordt als een functioneel onderdeel van een Hulpmiddel.
example: Voorbeelden zijn: handgreep, deurknop, veiligheidsgordel, bedhek, schakelaar, etc.

Medische fout
type: Class
subclass of: Therapeutische interventie
creator: RS
comment: Note that ErroneousTherapeuticInterventions are restricted to those events that involve errors in some task or procedure carried out on some PatientInCare. For other errors that can be associated with patient safety, see onz-g:ErroneousAdministrativeContentDevelopment for administrative errors and onz-g:ErroneousDispenseOfMedicalSubstance for dispensing errors. @en
comment: The onz-g allows to label ErroneousTherapeuticInterventions additionally as CalamityEvent or IncidentEvent, if desired. We deliberately do not describe what e.g. 'medication error' should or should not be considered an IncidentEvent as this fully depends on context and may change due to legislation and agreement shifts within the Care Domain. @en
definition: Editorial: ErroneousTherapeuticIntervention is the subclass of TherapeuticIntervention where some Caregiver makes some unintended error while carrying out some therapeutic task or procedure on a PatientInCare. @en

Eventieve perdurant
type: Class
subclass of: Perdurant
creator: RS
comment: Also see the definitions and explantion provided for the class onz-g:Perdurant. @en
comment: Note that from a Natural Language point of view, EventivePerdurants can expressed as nouns (arrival) and verbs (arrive). EventivePerdurants do rarely or perhaps never take the form of an adjective, at least not in English and Dutch. @en
definition: Editorial: An EventivePerdurant is a Perdurant that is cumulative and intrinsically implies some change in the world/state of affairs. @en
example: Examples are: inject.v, arrival.n, demolish.v, die.n, burial.n, urinate.v, buy.v, etc. @en

Declaratiedocument
type: Class
subclass of: Fysiek financieel document
creator: RS
definition: Editorial: Declaratie is een fysiek of digitaal document waarin de verschuldigde kosten wegens geleverde goederen, diensten of werkzaamheden staan beschreven.

Familiegroep
type: Class
subclass of: Groep mensen
creator: RS
definition: Editorial: FamilieGroep is een groep mensen waarvan de leden aan elkaar gerelateerd zijn door verwantschap, adoptie of een verbintenis zoals huwelijk en (geregistreerd) partnerschap.
definition: Editorial: FamilyGroup is a GroupOfHumans whose members bear relations to one another through kinship, adoption, marriage or partnerships. @en

Vrouwelijk geslacht
type: Class
subclass of: Geslacht
creator: RS
definition: FemaleSex is a Quality that inheres in Organisms and expresses the female biological sex of some Organism. @en

Financieel account
type: Class
subclass of: Account
creator: RS
definition: sumo: "A formal banking, brokerage, or business account established to provide for regular services, dealings, and other financial transactions." @en

Financieel-administratief informatieobject
type: Class
subclass of: Administratief informatieobject
creator: RS
comment: Note that subclasses of this class may not by definition represent concepts but also financial-administrative constructs that are merely needed to label administrative data. @en
definition: FinancialAdministrativeInformationObject is an AdministrativeInformationObject that expresses (uniformized) conceptions as they function specifically and exclusively in the financial administrative realm. @en
example: Examples include: 'cost centre', 'profit centre', etc. @en
example: Voorbeelden zijn: 'financieringsstroom', 'kostenplaats', 'kostendrager', etc.

Factuur
type: Class
subclass of: Fysiek financieel document
creator: RS
definition: Editorial: FinancialBill is a FinancialDocument that contains an itemized statement of money owed for goods shipped or services rendered. @en
example: 'factuur', 'nota', 'rekening', etc.

Fysiek financieel document
type: Class
subclass of: Fysiek document
creator: RS
definition: Editorial: FinancialDocument is a document that describes (some aspect of) a monetary transaction. @en
definition: Editorial: FinancieelDocument is een Document waarin (aspecten van) een financiele transactie worden beschreven.

Financiële entiteit
type: Class
subclass of: Niet-fysieke endurant
subclass of: Restriction
  all values from: Financiële waarde eigenschap
  on property: heeft eigenschap of kenmerk
subclass of: Restriction
  all values from: TijdEnPlaatsGebondenEntiteit
  on property: isToegekendeFinanciëleEntiteitVan
creator: RS
comment: Note that 'coins' and 'bank notes' are Artifacts (ContentBearingObjects) representing a fixed value that is stated on the Artifact itself. @en
comment: Note that FinancialEntity denotes some quantity of money as a whole; for representing the actual value of the FinancialEntity we refer to: onz-g:FinancialValue. @en
definition: Editorial: FinancialEntity is a NonPhysicalEndurant that represents some quantity of money considered as a whole at some point in time and/or during some exchange, e.g. during a FinancialTransaction. @en
example: Examples are: 'payment', 'budget', 'funding', 'wage', 'profit', 'fine', 'royalties', 'insurance premium', 'bribe', 'annual turnover', 'investment', etc. @en

Financieel informatieobject
type: Class
subclass of: Abstract informatieobject
creator: RS
comment: For physical objects that carry financial information, such as a 'bank statement' or 'the bill you receive in a restaurant', we refer to onz-g:FinancialDocument. @en
definition: Editorial: FinancialInformationObject is any unit of information that describes and/or transmits financial facts or statements. @en
example: Examples: 'the information on transactions represented in your bank statement', 'the information in the account book of some company'. @en

Financiële periode
type: Class
subclass of: Periode
creator: RS
definition: Editorial: FinancialPeriod is the subclass of ProperPeriod that captures all proper time intervals associated with finance and economics such as a 'fiscal year'. @en
example: Voorbeelden: 'boekjaar', 'fiscaal jaar', 'belastingjaar'.

Jaarrekening
type: Class
subclass of: Rapport
creator: RS
comment: Volgens de Nederlandse wetgeving dient een Jaarrapport te bestaan uit een balans, een winst-en-verliesrekening en een toelichting op beide. Zie ook: Boek 2 van het Burgelijk Wetboek, artikel 391.
definition: Editorial: FinancialReport is a formal Report that describes the financial activities and position of a business during the preceding year. @en
definition: Editorial: Jaarrekening is een Rapport waarin een overzicht van de financiële situatie van een Organisatie wordt gegeven en toegelicht over het afgelopen jaar.

Financiële transactie
type: Class
subclass of: Verandering van eigendom of bezit-gebeurtenis
subclass of: Restriction
  some values from: Financiële entiteit
  on property: heeft participant
creator: RS
comment: In case the onz-g needs to be extended with financial events, we refer to the notes provided for onz-g:Getting. @en
definition: Editorial: FinancialTransaction is the subclass of ChangeOfPossession where some FinancialAsset is exchanged between two Agents, often as compensation for the value of some Object that changes of ownership. @en
example: Examples are 'buy.v', 'sell.v', 'invest.v', 'rent.v', 'pay.v', etc. @en

Financiële waarde
type: Class
subclass of: Abstracte waarde
creator: RS
comment: Dus: een 'budget' (FinancialEntity) heeft een omvang/waarde (FinancialValueQuality) namelijk een 'waarde' (FinancialValue ) van '1 miljoen' (datatype), uitgedrukt in bijvoorbeeld 'Euro' (instance van UnitOfCurrency).
definition: Editorial: FinancialValue is an AbstractValue that captures the e.g. monetary/economic/financial value of some Endurant. @en

Financiële waarde eigenschap
type: Class
subclass of: Abstracte eigenschap
subclass of: Restriction
  all values from: Financiële waarde
  on property: heeft eigenschapswaarde
creator: RS
comment: Dus: een 'budget' (FinancialEntity) heeft een 'financiele omvang/waarde' (FinancialValueQuality) namelijk een waarde (FinancialValue ) van '1 miljoen' (datatype), uitgedrukt in bijvoorbeeld 'Euro' (instance van UnitOfCurrency). Ook zo: een 'rolllator' (PhysicalEndurant) heeft een 'financiele omvang/waarde' (FinancialValueQuality), namelijk een bepaalde 'waarde' (FinancialValue) van '600', uitgedrukt in bijvoorbeeld 'Dollar' (instance van UnitOfCurrency).
comment: Note the difference with e.g. QuantitativeMeasurementQuality that is an intrinsic quality of some PhysicalEndurant. No Endurant has an intrinsic economic value or worth, hence this quality is considered as an AbstractQuality. Therefore, in the case that someone want to know 'how much money there is', one may ask for: a.) the amount of e.g. coins and banknotes: to be modeled with ContentBearingObject and QuantitativeMeasurementQuality, or b.) the value of some financial entity (e.g. a deposit, a budget): to be modeled with FinancialEntity and FinancialValueQuality. @en
definition: Editorial: FinancialValueQuality is an AbstractQuality that characterizes the amount, value or price of some FinancialEntity or PhysicalEndurant. @en

Vaste groep of collectie
type: Class
subclass of: Groep of collectie
creator: RS
comment: Examples may include: twins, our solar system, an octave (music), an archipelago such as the Wadden Sea Islands. @en
definition: Editorial: FixedCollection is a Collection that carries an extensional Identity criterion, meaning that the Identity of the Collection can only be defined by its members. I.e.: members can not move in our out of the Collection without changing the Identity. @en

Voedselrol
type: Class
subclass of: Abstracte rol
creator: RS
comment: We consider Food to be a Role of some PhysicalObjects as no instance is necessarily and intrinsically Food. What can be considered Food is culturally dependent; typical examples are 'insects', 'dog meat' and 'whale meat'. @en
definition: Editorial: FoodRole is a role played by some PhysicalObjects that contain nutrients, such as carbohydrates, proteins, and fats, and that that can be ingested by some Human and metabolized into energy and body tissue. @en
example: Voorbeelden: 'voedsel', 'voeding', 'voedingsmiddelen', etc.

Formele identifier
type: Class
subclass of: Identifier-informatieobject
creator: RS
definition: Editorial: FormalIdentifier is a (mandatory) IdentifierInformationObject issued by some GovernmentOrganization under the ruling of some legislation. @en
example: Examples: Social Security Number (US), National Health Insurance Number (UK), VAT Number. @en
example: Voorbeelden: 'Burger Service Nummer (BSN)', 'Kamer van Koophandel nummer', 'BTW-nummer', etc.

Vrijheidsbeperkende gebeurtenis
type: Class
subclass of: Menselijke interactie-gebeurtenis
creator: RS
relation: https://zibs.nl/wiki/VrijheidsbeperkendeInterventie-v1.3(2024NL)
comment: Note that onz-g also has a class for instantiating Objects and Substances that as a secondary function have a freedom restrictive function. See: onz-g:FreedomRestrictionRole. For Objects that restrict the freedom of some PatientInCare as their primary function, see: onz-g:PhysicalRestraintDevice. @en
definition: Editorial: FreedomRestrictionEvent is a SocialInteractionEvent that is carried out by some Caregiver in order to restrict the freedom of some PersonInCare with the intention to protect this Person and/or others for injuries and damage to personal health. @en
example: 'uitvoeren/toepassen van een vrijheidsbeperkende maatregel', 'vrijheidsbeperkende interventie', 'onvrijwillige zorg', 'verplichte zorg'.

Vrijheidsbeperkende rol of functie
type: Class
subclass of: Abstracte rol
creator: RS
comment: Examples of PhysicalObjects and Substances that may have a secondary role or function as restricting freedom of some PatientInCare are onz-g:Bedrail, onz-g:WheelchairTable and onz-g:SafetyBelt. Note that onz-g also includes classes for medical substances that may be applied in this role. For this, we refer to onz-g:TherapeuticSubstance and its subclasses. @en
comment: For Artifacts, that is concrete and man-made objects, which primary function is to restrain some Person, we refer to onz-g:PhysicalRestraintDevice. This class is specialized into e.g. onz-g:LimbAndTorsoRestraint and onz-g:TrunkRestraint. @en
definition: Editorial: FreedomRestrictionRole is the role assigned to some PhysicalObject or Substance that as a secundary function may be used to intentionally restrict the freedom of some Person in order to protect this Person and/or others for injuries and damage to personal health. @en

Freelancer
type: Class
subclass of: Werker
creator: RS
definition: Editorial: Freelancer is the Role of some Human who is self-employed and sells his services to several employers without being committed to these employers on the long term. @en
definition: Editorial: ZZP is de rol van een persoon waarbij iemand werkt voor verschillende opdrachtgevers, zonder dat er sprake is van een dienstverband.
example: ZZP, ZZP'er, zelfstandige zonder personeel, freelancer, eenpitter.

Vriend of vriendin
type: Class
subclass of: Relationele rol
creator: RS
definition: Editorial: Friend is the Role of some Human and corresponds to the connection someone has to another Human where both share some mutual care and concern and some common interests. @en

Schimmel
type: Class
subclass of: Organisme
creator: RS
definition: Editorial: Fungus is a one or multicellular Organism that lacks chlorophyll and obtains the energy to exist and grow from organic Substances. @en

Genderidentiteit
type: Class
subclass of: Organische eigenschap
subclass of: Restriction
  some values from: Genderidentiteitswaarde
  on property: heeft eigenschapswaarde
subclass of: Restriction
  all values from: Mens
  on property: is eigenschap of kenmerk van
creator: RS
definition: GenderIdentity is a BiologicalQuality that characterizes as to what gender some Human identifies with. @en

Genderidentiteitswaarde
type: Class
subclass of: Organisme-eigenschapswaarde
creator: RS
comment: Note that that this class is for values for possible gender identities; for the biological sex that is inherent to some Organism, inlcuding Humans, we refer to the Quality onz-g:BiologicalSex. @en
definition: Editorial: Instances of GenderIdentityValue express the values for the gender some Human identifies himself with such as 'agender' and 'genderfluid'. @en

Huisarts
type: Class
subclass of: Arts
creator: RS
definition: Wikipedia: GeneralPhysician ia a MedicalDoctor who treats acute and chronic illnesses in Humans and provides preventive care and health education. @en

Geografisch gebied
type: Class
subclass of: Gebied of oppervlak
creator: RS
definition: Editorial: GeografischGebied is een Gebied met een vastomlijnde grens.
definition: Editorial: GeographicArea is a geographic PhysicalObject with definite boundaries. @en
example: Examples are: city, village, estuary, harbor, parking lot, cave, etc. @en
example: Voorbeelden zijn: stad, dorp, baai, haven, parkeerterrein, grot, etc.

Geografische eigenschap
type: Class
subclass of: Ruimtelijke eigenschap
subclass of: Restriction
  some values from: Class
    union of: Perdurant
    union of: Concrete endurant
  on property: is eigenschap of kenmerk van
subclass of: Restriction
  all values from: Geografische plaats-waarde
  on property: heeft eigenschapswaarde
creator: RS
comment: Note that this Quality is for modeling the position of some PhysicalEndurant with Quality region pattern to some GeographicValue, i.e. in order o state that some city/bridge/organization/event has a Geographic Quality, specified by any range of GeographicValues such as long/lat coordinates, location names such as 'Amsterdam', etc. @en
definition: Editorial: GeographicQuality is a SpatialQuality that inheres in some PhysicalEndurant or Perdurant and characterizes the location of some entity in some geographic space. @en

Geografische plaats-waarde
type: Class
subclass of: Plaats- en ruimtewaarde
creator: RS
comment: For a shared rdf vocabulary for geographical locations, we refer to: https://www.geonames.org. @en
definition: Editorial: Instances of GeographicValue are SpatialValues that describe the geographical location of some entity such as 'France', 'Amsterdam' and '48.764400, -1.571040'. @en

Geopolitiek gebied
type: Class
subclass of: Geografisch gebied
creator: RS
definition: Editorial: GeopoliticalArea is a GeographicArea that is associated with some governmental structure and/or jurisdiction. @en
example: Examples are: 'a country', 'a province', 'a city'. @en

Geriater
type: Class
subclass of: Arts
creator: RS
definition: Editorial: Geriatrician is a MedicalDoctor who promotes health in older Humans by preventing and treating diseases and disabilities. @en

Krijgen
type: Class
subclass of: Verandering van eigendom of bezit-gebeurtenis
creator: RS
comment: Note that Getting and Giving are basically two sides of the same coin due to a change of perspective on either the receiver or the giver. This also holds for e.g. Buying and Selling. In other words: there is basically one event that can be labeled as a Giving event if the perspective of the giver is taken into account, while the same event will be labeled as a Getting event from the perspective of the receiver. As an example, see how these two sentences express the same event: "Yesterday, John received a grey sweater from Mary" vs "Yesterday, Mary gave a grey sweater to John". In other words: if two specific event graphs need to be compared on their unicity it should be noted that the labeling can not be decisive in case of perspectivized event labels such as Buying/Selling and Getting/Giving. @en
comment: Note that Getting and Giving are subclasses of ChangeOfPossession where some Object changes of ownership. As such, getting some illness, physical appearance or other attributes should not be labeled with onz-g:Getting. As an example: "getting measles, getting a beard, getting a feeling" are light verb + noun combinations that point to some attribute coming into existence, not a ChangeOfPossession. @en
definition: Editorial: Getting is the subclass of ChangeOfPossession where someone is handed over the possession and/or usage of some object. @en

Geven
type: Class
subclass of: Verandering van eigendom of bezit-gebeurtenis
creator: RS
comment: See the notes provided for the class onz-g:Getting. @en
definition: Editorial: Giving is the subclass of ChangeOfPossession where someone hands the possession and/or control of something over to someone else. @en

Bestuurlijke overheidsorganisatie
type: Class
subclass of: Organisatie
subclass of: Restriction
  some values from: Geopolitiek gebied
  on property: bestuurt
creator: RS
comment: Voor Nederland: de term 'Overheid' kan betrekking hebben op elke Organisatie die het hoogst bevoegde en uitvoerende gezag heeft over een bepaald fysiek gebied (provincie, gemeente, land, bisdom, diocees) of een maatschappelijk domein (bijvoorbeeld: Zorg en Welzijn). Daarmee is 'Overheid' een verzamelterm voor alle Organisaties die op enig niveau en onderwerp 'hoogst bevoegde gezag' hebben. Daarnaast wordt 'Overheid' in het dagelijks taalgebruik ook geassocieerd met Organisaties die diensten uitvoeren voor of namens een BestuurlijkeOverheidsOrganisatie Voor onz-g is nu de klasse BestuurlijkeOverheidsOrganisatie opgenomen voor die OverheidsOrganisaties die bestuurlijk gezag hebben en voor hun samenstelling direct (bijv. Gemeenteraad) of indirect (Provinciale Staten) beinvloed worden door democratische processen zoals verkiezingen. Voor overige Organisaties die geassocieerd worden met de term 'Overheid', maar geen uitvoerend gezag hebben op basis van een democratisch proces zoals een verkiezing, verwijzen we naar onz-g:PubliekeDienstOrganisatie.
definition: Editorial: BestuurlijkeOverheidsorganisatie is een Organisatie die, op enig niveau, een GeopolitiekGebied bestuurt.
definition: Editorial: GovernmentOrganization is an official Organization that is concerned with the government of a GeopoliticalArea at some level. @en

Groep mensen
type: Class
subclass of: Variabele groep of collectie
subclass of: Restriction
  on class: Mens
  min qualified cardinality: 2
  on property: heeft lid
creator: RS
definition: Editorial: GroupOfHumans is a VariableCollection whose members are exclusively Humans. @en

Richtlijn
type: Class
subclass of: Plan
creator: RS
definition: Editorial: Guideline is a detailed plan or explanation that guides some Person or Organization in setting some standard or determining some course of action. @en
definition: Editorial: Richtlijn is een gedetailleerd Plan waarin wordt uitgelegd hoe een Persoon of Organisatie kan voldoen aan een bepaalde standaard of waarmee een doelgericht stappenplan kan worden bepaald.

Zorgverzekeringsmaatschappij
type: Class
subclass of: Verzekeringsmaatschappij
creator: RS
definition: Editorial: HealthcareInsuranceCompany is a Business that sells Healthcare insurances to Persons. @en
definition: Editorial: Zorgverzekeringsmaatschappij is een Bedrijf dat zorgverzekeringen verkoopt aan Personen.
example: zorgverzekeraar, zorgverzekeringsmaatschappij, 'met de zorgverzekering bellen over een declaratie', etc.

Zorgverzekeringspolis
type: Class
subclass of: Verzekeringspolis
creator: RS
definition: Editorial: HealthInsurancePolicy is a Certificate that states the terms and conditions of financial reimbursement by some HealtcareInsuranceOrganisation if some Person has to make expenses for e.g. medical treatment, medication, medical advice and personal medical devices. @en
definition: Editorial: Ziektekostenverzekeringspolis is een Verzekeringspolis waarin de voorwaarden staan opgesteld waarin een Zorgverzekeraar overgaat tot het uitbetalen voor de kosten van medisch advies, behandelingen, medicijnen, het gebruik van hulpmiddelen of andere voorzieningen op grond van een medische noodzaak.

Gezondheidszorgwet
type: Class
subclass of: Wet
creator: RS
comment: Since the legal domain is not the primary focus of this ontology, we only model HealthcareLaw as a concept for any laws setting rules for the Healthcare domain. A set of specific laws for Dutch Healthcare have been defined as instances of this class. Since instances can cease to exist while concepts can not, the individual laws have not been modeled as classes in this ontology. @en
definition: Editorial: HealthcareLaw is a description imposed by some authority that sets forth rules governing some activity in the Healthcare and Cure domain and that can be enforced with penalties for noncompliance. @en

Zorgkantoor
type: Class
subclass of: Pubieke dienst-organisatie
creator: RS
definition: Editorial: Zorgkantoor is een ServiceOrganisatie die in Nederland anno 2020 de Wet Langdurige Zorg uitvoert door contracten af te sluiten met een ZorgOrganisatie die een bepaald soort zorg en van een zekere duur gaat leveren aan een persoon die daar recht op heeft na een evaluatie en besluit van een andere ServiceOrganisatie, i.c. het Centrum Indicatiestelling Zorg.
definition: In the Dutch situation anno 2020, HealthcareOffice is a ServiceOrganization that carries out a specific HealtcareLaw for which instances of HealthcareOffice contract some CareOrganization that will provide the amount and type of care some Person is entitled to according to some assessment and decision made by another ServiceOrganization. @en

Zorgprofessional
type: Class
subclass of: Beroeps- of ambachtsrol
creator: RS
relation: https://zibs.nl/wiki/Zorgverlener-v4.0(2024NL)
definition: Editorial: HealthcareProfessionRole is the Role of a Human who has had some form of professional training or a specific education and has the credentials to carry out a set of skilled tasks related to human Healthcare. @en

Medische volmacht
type: Class
subclass of: Fysiek certificaat
creator: RS
definition: Editorial: HealthcareProxy describes who some Person has appointed to legally make healthcare decisions on their behalf, when this Person is incapable of making healthcare-related decisions. @en
definition: Editorial: MedischeVolmacht is een beschrijving waarin een Persoon een ander aanwijst om medische beslissingen te nemen wanneer de Persoon zelf geen beslissingen meer kan nemen over medische behandelingen of zijn eigen gezondheid door wilsonbekwaamheid veroorzaakt door ziekte of aandoeningen.

Audicien
type: Class
subclass of: Beroeps- of ambachtsrol
creator: RS
definition: Editorial: HearingInstrumentSpecialist is the ProfessionRole of a Human who assesses Humans with hearing problems and who advises and tailors some hearing aid to improve the auditory perception. @en

Thuiszorgorganisatie
type: Class
subclass of: Zorgorganisatie
creator: RS
definition: Editorial: HomeCareOrganization is a CareOrganization that provides care and domestic support at home for Persons who are (temporarily) not capable to carry out these tasks due to some disease, condition or disability. @en
definition: Editorial: ThuiszorgOrganisatie is een ZorgOrganisatie die erop gericht is om zorg, verpleging en huishoudelijke ondersteuning te geven aan Personen die thuis wonen en die door ziekte, beperking of aandoening (tijdelijk) niet in staat zijn hier zelf in te voorzien.

Hospice
type: Class
subclass of: Zorgorganisatie
creator: RS
definition: Editorial: Hospice is a CareOrganization that provides care and support for Persons who are terminally ill. @en
definition: Editorial: Hospice is een ZorgOrganisatie die er op gericht is zorg en ondersteuning te verlenen aan Personen met een terminale ziekte of aandoening.

Ziekenhuisorganisatie
type: Class
subclass of: Zorgorganisatie
creator: RS
comment: For specific types of Hospitals, we refer to the list of Hospitals provided in SnoMed. See the mapping provided to this term in SNOMED. @en
definition: Editorial: Hospital is a CareOrganization that provides specialized care and treatment for Humans. @en
definition: Editorial: ZiekenhuisOrganisatie is een ZorgOrganisatie die gespecialiseerde zorg en behandeling verleent aan Personen.

Mens
type: Class
subclass of: Zoogdier
subclass of: Restriction
  all values from: Class
    union of: Verblijfsobject
    union of: Gebouw
  on property: heeft verblijf in
disjoint union of: Intersekse persoon
disjoint union of: Man
disjoint union of: Vrouw
creator: RS
example: 'mens', 'persoon', 'individu'.

Menselijke anatomische entiteit
type: Class
subclass of: Dier-anatomische entiteit
disjoint with: Organisme
creator: RS
definition source: http://purl.org/sig/ont/fma/fma67135
comment: For an extensive scientifically motivated and medically approved ontology for the structure of the human body, we refer to the Foundational Model of Anatomy Ontology (FMA). For onz-g, we included a small set of subclasses of http://purl.org/sig/ont/fma/fma67135(= Post natal anatomical structure) that refer to FMA by means of SKOS mappings. The fully axiomatized version of FMA can be downloaded here: https://bioportal.bioontology.org/ontologies/FMA Also see: -Rosse, C., & Mejino Jr, J. L. (2003). A reference ontology for biomedical informatics: the Foundational Model of Anatomy. Journal of biomedical informatics, 36(6), 478-500. -http://sig.biostr.washington.edu/projects/fm/AboutFM.html @en
comment: Note that for instantiating where some condition such as a PressureUlcer is located on a Persons body, one is advised to use a onz-g:QualityValue, more specifically onz-g:PositionalValue. For a standardized set of values, e.g. 'upper left arm' one can reuse the vocabulary provided by Snomed (see specification for the class onz-g:PositionalValue), or, alternatively, the FMA. As such, all subclasses of onz-g:AnatomicalStructure provide placeholders for future extensions if necessary, though we recommend to reuse FMA and/or SnoMed depending on the specific information need. @en
definition: HumanAnatomicalEntity is an OrganicObject "which is generated by coordinated expression of the organisms own genes that guide its morphogenesis; has inherent 3D shape; its parts are connected and spatially related to one another in patterns determined by coordinated gene expression." Source: The Foundational Model of Anatomy Ontology (FMA). (http://purl.org/sig/ont/fma.owl) @en

Identifier-informatieobject
type: Class
subclass of: Abstract informatieobject
subclass of: Restriction
  some values from: Particular
  on property: identificeert
creator: RS
definition: Editorial: IdentifierDescription is an InformationObject that is used to (uniquely) identify some entity within some situation, such as an Employee, a Human, AccomodativeObject, BankAccount, etc. @en

Incidentgebeurtenis
type: Class
subclass of: Eventieve perdurant
creator: RS
comment: The extension of this class is open to change, interpretation and context while no member of the extension is necessarily a member. As such, this class has no defined subclasses or 'one of' axioms. See onz-g:CalamityEvent for more explanation and some examples. @en
definition: Editorial: IncidentEvent is an unintended and unexpected event related to quality of care and that may result, has resulted or could have resulted to some form of injury or damage in some PatientInCare . (Loosely translated definition of: 'incident' in: "Wet Kwaliteit, Klachten en Geschillen Zorg" or Dutch legislation on Quality of Care and Complaints & Disputes.) @en
definition: Incident is een niet-beoogde of onverwachte gebeurtenis, die betrekking heeft op de kwaliteit van de zorg, en heeft geleid, had kunnen leiden of zou kunnen leiden tot schade bij de cliënt. (Definitie 'incident' uit: Wet Kwaliteit, Klachten en Geschillen Zorg)

Toenemen
type: Class
subclass of: Verandering in hoeveelheid
creator: RS
definition: IncreasingEvent is the subclass of QuantityChangeEvent where the quantity of some Entity becomes more. @en
example: 'toenemen', 'aanwas', 'stijgen', 'vermeerderen', 'vergroten', 'verdubbelen', 'uitbreiden', 'groei', etc.
example: Examples: 'the number of patients doubled last year', 'the index gained 20 points', 'the proliferation of nuclear energy', 'the farmaceutical industry has raised its prices for orphan drugs' @en

Abstract informatieobject
type: Class
subclass of: Niet-fysieke endurant
subclass of: Restriction
  all values from: Informatiedragend artefact
  on property: gedragen door
subclass of: Restriction
  all values from: Abstract informatieobject
  on property: heeft deel
subclass of: Restriction
  all values from: Particular
  on property: gaat over
creator: RS
comment: Note that InformationObjects are not te be confused with tangible Objects. InformationObjects have no weight and can not be touched. InformationObjects can be 'materialized' in books, digital formats and other content bearing objects. Also, note that InformationObjects can only have InformationObjects as their parts. For the relation between InformationObject and ContentBearingObject, the onz-g defined the onz-g:bears and onz-g:borneBy properties. @en
definition: Editorial: InformationObject is a NonPhysicalEndurant that represents 'information' or a 'message'. @en
example: 'informatie', 'boodschap', 'inhoud', etc.
example: Examples are: 'the content of a letter or email', 'the content of your employment contract', 'the information in your patient record', 'the address of your friend', etc. @en

Verwonden
type: Class
subclass of: Beschadigen
creator: RS
comment: Note that we pose no formal restrictions on what or who injures who. As such, 'John injured himself', 'the cat injured me', 'John injured Mary' and 'his tight shoes injured him badly' are all considered instances of onz-g:Injuring. Note that some instances of onz-g:InjuringEvent may also be labeled additionally as a onz-g:SelfHarmEvent if applicable in some context. For the result of some InjuringEvent (an injury), we refer to onz-g:AbnormalOrganicMorphologyQuality and its subclasses. @en
definition: Editorial: InjuringEvent is an InternalChange where some trauma or injury comes into existence in some OrganicObject, usually through some external cause or force. @en
definition: http://www.ontologyportal.org/translations/SUMO.owl.txt#Injuring
example: 'verwondingen oplopen', 'zich bezeren', 'een been/arm/heup breken', 'verwonden', 'blesseren', 'zich pijn doen (aan)', etc.

Instrument semantische rol
type: Class
subclass of: Semantische rol
creator: RS
comment: Examples: "Mary hit John with A BASEBALL BAT." "Mary flew to New York in THE NEWEST AIRBUS." @en
definition: Editorial: An InstrumentCaseRole is played by a participant of some Perdurant and is used by some agent to help bring about the Perdurant. @en

Verzekeringsmaatschappij
type: Class
subclass of: Bedrijf
creator: RS
definition: Editorial: InsuranceCompany is a Business that sells InsurancePolicies to Persons and Organizations. @en
definition: Editorial: Verzekeringsmaatschappij is een Bedrijf dat Verzekeringen verkoopt aan Personen en Organisaties.
example: 'verzekeraar', 'verzekeringsmaatschappij', 'assurantiemaatschappij'.

Verzekeringspolis
type: Class
subclass of: Fysiek certificaat
creator: RS
definition: Editorial: InsurancePolicy is a Certificate that states the terms and conditions of financial reimbursement by some InsuranceCompany after some Person or Organization experienced loss, damage, injury or death. @en

Intentionele gebeurtenis
type: Class
subclass of: Eventieve perdurant
creator: RS
comment: Note that 'intentional' should not be understood as 'on purpose'. Therefore, events such as 'wrong medicament supplied to patient' are considered to be an IntentionalEvent since supplying the medicament was preceded by some decision. In other words: IntentionalEvents can go wrong or can be are carried out based on some ill- or uninformed decisions and assumptions. Also note that IntentionalEvents can be performed by e.g. humans, groups of humans and animals. @en
broad match: http://www.ontologyportal.org/translations/SUMO.owl.txt#IntentionalProcess
definition: Editorial: IntentionalEvent is an EventivePerdurant that has some purpose for the CognitiveAgent who/that performs it. @en

Intentioneel proces
type: Class
subclass of: Statische perdurant
creator: RS
comment: For the difference between IntentionalProcess (stative) and IntentionalEvent (eventive), see the explanation provided for the class onz-g:Perdurant. In short: EventivePerdurants imply an intrinsic result that holds for all possible instances of that class and is identical for all instances of that class while StativePerdurant don't have an intrinsic result other 'not happening/no longer happening'. For example: 'buying' implies as result some change of ownership, hence: EventivePerdurant. 'assisting someone' implies no change other than perhaps 'no longer assisting someone', hence: StativePerdurant. @en
broad match: http://www.ontologyportal.org/translations/SUMO.owl.txt#IntentionalProcess
definition: Editorial: IntentionalProcess is a StativePerdurant that has some purpose for the CognitiveAgent that performs it. @en

Stagiair
type: Class
subclass of: Werker
creator: RS
definition: Domeindefinitie (gebaseerd op de CAO-VVT): Stagiar is een leerling die een MBO- of een HBO-opleiding volgt binnen het OCW-opleidingsstelsel (beroepsopleidende leerweg) en vanuit deze opleiding onder begeleiding werkzaamheden verricht bij een zorgorganisatie.
definition: Editorial: Intern is the role of some Human who works, with or without financial compensation, in order to gain work experience or satisfy requirements for a qualification. @en
definition: Editorial: Stagiair is de Rol van een Persoon die als onderdeel van een opleiding en de te behalen leerdoelen tijdelijk werkzaamheden verricht bij een Organisatie.

Interne verandering
type: Class
subclass of: Eventieve perdurant
creator: RS
comment: Note that 'alive' and 'healthy' are considered internal qualities of some Objects as well. As such, EventivePerdurants like 'injuring' and 'killing' result in some change of an internal quality of some Object and therefore are modeled as InternalChange. Also note that onz-g does not impose any restrictions on who or what plays the causal role in enforcing the change of some internal attribute in some Object. In other words: 'the eartquake destroyed the house' and 'Mary destroyed the vase' and 'John killed Mary' are all instances of InternalChange or one of its subclasses. Also see the explanation provided for the class onz-g:SocialInteractionEvent. @en
definition: InternalChange is an EventivePerdurant that involves altering an InternalQuality of some PhysicalObject, e.g. its shape, its coloring, its structure, its mass, its existence, etc." @en

Interne fysieke waarde
type: Class
subclass of: Concrete waarde
creator: RS
definition: Editorial: Instances of InternalPhysicalValue indicate values that are dependent on and internal to some PhysicalEndurant. @en
example: Example values may include: 'supine position', 'capable of dressing self', '54 (kilo)', '10 (ml)', etc. @en

Interne eigenschap
type: Class
subclass of: Concrete eigenschap
creator: RS
definition: Editorial: InternalQuality is a Quality that is dependent on and internal to some PhysicalEndurant. @en
example: Examples: having some color, carrying some disease, being introverted, being able to bend your knee, being dead, having twelve employees, etc. @en

Intersekse persoon
type: Class
subclass of: Mens
subclass of: Restriction
  some values from: Intersexe geslacht
  on property: heeft eigenschap of kenmerk
creator: RS

Intersexe geslacht
type: Class
subclass of: Geslacht
creator: RS
definition: Intersexual is a Quality that inheres in Organisms and expresses the intersexual sex of some Organism, i.e. having both female and male characteristics. @en

Intervalwaarde
type: Class
subclass of: Duur- en tijdswaarde
creator: RS
definition: Instances of IntervalValue express some time value with a duration and/or extent. @en

Onderzoekgebeurtenis
type: Class
subclass of: Intentionele gebeurtenis
creator: RS
comment: Note that typical subprocesses of investigating such as 'thinking' and 'comparing' are intentional cognitive processes and not subclasses of onz-g:InvestigationEvent. The difference is that intentional cognitive processes are realized entirely within the human brain while instances of InvestigationEvent also comprise body-external actions. See also: onz-g: CognitiveProcess @en
definition: Editorial: InvestigationEvent is an IntentionalEvent where some Human carries out some action to obtain information. @en
example: Examples are : investigate.v., audit.v, search.v, analyse diagnostically.v, examine.v, inspect.v., etc. @en

Werken
type: Class
subclass of: Menselijke interactie (proces)
creator: RS
definition: Editorial: LabouringProcess is a SocialInteractionProcess where some Person executes tasks in the context of being employed by some Employer. @en
example: voorbeelden: '(ergens) werken', 'arbeid verrichten', 'aan het werk zijn', etc.

Landareaal
type: Class
subclass of: Geografisch gebied
creator: RS
definition: Editorial: LandArea is a GeographicArea that predominantly consists of solid ground.
example: Examples are: desert, island, parking lot. @en

Landtransit-areaal
type: Class
subclass of: Landareaal
creator: RS
definition: Editorial: LandTransitArea is the subclass of LandArea and is intended for Translocation over ground. @en

Wet
type: Class
subclass of: Maatschappelijk informatieobject
creator: RS
definition: Editorial: A law is an InformationObject imposed by some authority that sets forth a rule governing some particular activity and that can be enforced with penalties for noncompliance. @en
example: Voorbeeld: de 'Wet Langdurige Zorg'.

Curator
type: Class
subclass of: Sociale rol
creator: RS
definition: Editorial: LegalGuardian is the Role of a Person who has the legal authority and the corresponding duty to care for the financial and personal interests of some other Person. @en

Lengte
type: Class
subclass of: Kwantitatief-meetbare eigenschap
subclass of: Restriction
  all values from: Lengtewaarde
  on property: heeft eigenschapswaarde
creator: RS
relation: https://zibs.nl/wiki/Lichaamslengte-v3.1.2(2024NL)
definition: Editorial: LengthQuality is a QuantitativeMeasurementQuality that characterizes the linear extent in space of some PhysicalObject. @en
example: Examples include: "the length of a feeding tube", "the length of his left leg", "the length of the table", "his lenght (is 6 ft)", etc. @en

Lengtewaarde
type: Class
subclass of: Kwantificeerbare meetwaarde
creator: RS
definition: Editorial: Instances of LengthValue express the quantity values of the physical quality Length. @en

Laesie
type: Class
subclass of: Abnormale morfologische eigenschap
creator: RS
definition: Editorial: Lesion is an AbnormalOrganicMorphologicalQuality that inheres in some tissue of an Organism due to some DiseaseOrSyndrome or InjuringEvent. @en

Zweedse band
type: Class
subclass of: Mobiliteitsbeperkend middel
creator: RS
definition: Editorial: ZweedseBand is een MobiliteitsBeperkendMiddel waarbij een Persoon door een band om de torso en een of meerdere ledematen wordt gefixeerd aan een bed of stoel.

Lijst
type: Class
subclass of: Abstract informatieobject
creator: RS
definition: List is is the subclass of InformationObject and consists of a list of items arranged and/or ordered according to some organizing principle. @en
example: Examples: a shopping list, a criminal record, a code list, a waiting list, a play list, etc. @en

Lokaliseerbaar gebied
type: Class
subclass of: Geografisch gebied
subclass of: Restriction
  some values from: Localiseerbaar-gebiedsidentifier
  on property: geïdentificeerd door
creator: RS
comment: Note that bag:AdresseerbaarObject subsumes classes that denote both GeographicAreas and Artifacts which is not a modeling approach we adhere to in onz-g as it leads to inconsistencies. Hence, we do not create any mapping here. @en
comment: Note that onz-g:Buildings and onz-g:AccomodativeObjects are placed on some onz-g:LocalizableArea and that this LocalizableArea can be described with some LocalizablePlaceInformationObject e.g. an Address. For instance, if some house is demolished and replaced with some new house, the LocalizablePlaceInformationObject of the new house will be unchanged as it is connected to the LocalizableArea and not the house. Also note that for instantiating spatial qualities of Buildings and AccomodativeObjects, one can choose to use the aforementioned LocalizablePlace and LocalizablePlaceInformationObject design pattern for e.g. Address, Postcode etc. Alternatively, for e.g. longitude-latitude like data, one is advised to use the quality reification pattern. See: onz-g: GeographicValue and the explanation provided for the class onz-g:QualityValue. To understand the difference between onz-g:LocalizablePlaceInformationObject and onz-g:GeographicValue, it may help to keep in mind that InformationObjects depend on some CognitiveAgent and a Situation while onz-g:GeographicValue just captures some spatial dimension. In other words: CognitiveAgents can decide to replace some InformationObject due to a new Situation, while QualityValues can only (at best and not always) be manipulated by some CognitiveAgent. @en
definition: LocalizableArea is a GeographicArea that can be identified by some LocalizablePlaceInformationObject such as an Address or Postcode. @en

Localiseerbaar-gebiedsidentifier
type: Class
subclass of: Plaats- of locatieidentifier
subclass of: Restriction
  all values from: Lokaliseerbaar gebied
  on property: identificeert
creator: RS
definition: Editorial: LocalizablePlaceInformationObject is a PlaceDescriptionInformationObject that is used to identify some LocalizableArea. @en
example: Examples are postcodes, highway numbers, addresses, etc. @en

Langdurige zorg
type: Class
subclass of: Zorgdiensten
subclass of: Restriction
  some values from: Gezondheidszorgwet
  on property: formeel gedefinieerd door
creator: RS

Mannelijk geslacht
type: Class
subclass of: Geslacht
creator: RS
definition: MaleSex is a Quality that inheres in Organisms and expresses the male biological sex of some Organism. @en

Zoogdier
type: Class
subclass of: Dier
creator: RS
definition: sumo: Mammal is an Organism "having a constant body temperature and characterized by the presence of hair, mammary glands, and sweat glands." @en

Man
type: Class
subclass of: Mens
subclass of: Restriction
  some values from: Mannelijk geslacht
  on property: heeft eigenschap of kenmerk
creator: RS

Manager
type: Class
subclass of: Functie in organisatie-rol
creator: RS
definition: Editorial: Manager is the subclass of OccupationalPositionRole where some Human carries out a specific function within some Organization that includes e.g. organizing-, coordinating-, supervising- and decisional tasks. @en

Massa of gewicht
type: Class
subclass of: Kwantitatief-meetbare eigenschap
subclass of: Restriction
  all values from: Gewichts- of massawaarde
  on property: heeft eigenschapswaarde
creator: RS
relation: https://zibs.nl/wiki/Lichaamsgewicht-v4.0(2024NL)
definition: MassQuality is a QuantitativeMeasurementQuality that characterizes the weight of some PhysicalEndurant. @en

Gewichts- of massawaarde
type: Class
subclass of: Kwantificeerbare meetwaarde
creator: RS
definition: Editorial: Instances of MassValue express the values of the Quality MassQuality. @en
example: Examples: This patient weighs "75" kilo; the grocery bag is "heavy", etc. @en

Meetinstrument
type: Class
subclass of: Fysiek hulpmiddel
creator: RS
definition: Editorial: MeasuringDevice is an Device that has as purpose to serve as an instrument in deriving some QuantitativeMeasurementValue. @en
definition: Editorial: Meetinstrument is een fysiek hulpmiddel dat als doel heeft om als instrument te worden gebruikt bij het vaststellen van een hoeveelheid van iets (specifiek: een QuantitativeMeasurementValue).
example: Examples: a blood pressure gauge, a thermometer, etc. @en

Meetgebeurtenis
type: Class
subclass of: Meet- of vaststelgebeurtenis
creator: RS
definition: Editorial: MeasuringEvent is the subclass of AssessingEvent where some Human determines the QuantativeMeasurementQuality of some Entity. @en
example: 'He measured the length of the tube'; 'she weighed the patient carefully', etc. @en

Medisch classificatiesysteem
type: Class
subclass of: Classificatiesysteem
creator: RS
definition: Editorial: Instances of MedicalClassificationSystem are descriptive structures that provide some shared organization and definition of Human health and functioning levels in the broadest sense. @en

Arts
type: Class
subclass of: Zorgprofessional
creator: RS
definition: Wikipedia: 'MedicalDoctor is a HealthcareProfessionRole of a human who practises medicine, which is concerned with promoting, maintaining, or restoring health through the study, diagnosis, prognosis and treatment of disease, injury, and other physical and mental impairments.' @en

Medische gegevens
type: Class
subclass of: Abstract informatieobject
creator: RS
definition: Editorial: MedicalInformationObject is the class for medical information and case history concerning some PatientInCare. @en
example: 'medische informatie', 'patientdossier', 'medische voorgeschiedenis', 'contactverslag'.

Doktersrecept
type: Class
subclass of: Fysiek certificaat
creator: RS
definition: Editorial: MedicalPrescription is the written authorization of some HealthcareProvider for some Person to purchase a prescription drug from a Pharmacist. @en

Medische score of -waarderingseigenschap
type: Class
subclass of: Normatieve waarde eigenschap
subclass of: Restriction
  all values from: Medische beoordelingswaarde
  on property: heeft eigenschapswaarde
creator: RS
broad match: http://purl.bioontology.org/ontology/SNOMEDCT/272396007
definition: Editorial: MedicalRatingQuality is an AbstractQuality that characterizes the severity, stage or level of some DiseaseOrSyndrome or BiologicalQuality in some Organism. @en
example: Examples: the severity or stage of some pressure ulcer, the development stage of some neoplasm, the level of hearing loss, etc. @en

Medische beoordelingswaarde
type: Class
subclass of: Normatieve waarde
creator: RS
comment: An example data value is e.g. '85%', which can be the value of the general performance of some human in daily activities, assessed with the Barthel scale as the instance of onz-g:MedicalClassificationSystem. @en
definition: Editorial: Instances of MedicalRatingValue express values for some BiologicalQuality based on some medical classification or rating system. @en

Bijeenkomst
type: Class
subclass of: Menselijke interactie (proces)
subclass of: Restriction
  all values from: Particular
  on property: heeft onderwerp van bijeenkomst
creator: RS
relation: https://zibs.nl/wiki/Contact-v6.0(2024NL)
comment: Editorial: Meeting is an IntentionalProcess where two or more CognitiveAgent are (digitally) together for the purpose of communication. @en
example: 'bijeenkomst', 'vergadering', 'meeting', 'overleg', 'ontmoeten', 'samenkomen', 'consult', 'telefonisch consult', etc.
example: Examples: a lecture, a board meeting, a team meeting, a conference, a wedding, a funeral, a teleconference, a consultation, etc. @en

Handelsonderneming
type: Class
subclass of: Bedrijf
creator: RS
comment: Examples of MercantileOrganization are shops such as Drugstore, GroceryStore and MedicalWholesale. @en
definition: Editorial: Handelsonderneming is een Bedrijf dat met een winstoogmerk FysiekeObjecten of een service verkoopt aan Personen en/of Organisaties.
definition: Editorial: MercantileOrganization is a Business that sells PhysicalObjects or services to customers for a profit. @en
example: 'handelsonderneming', 'winkel', 'winkelbedrijf'.

Methode
type: Class
subclass of: Procedure-descriptie
creator: RS
definition: Editorial: Method is systematic description on the way of doing something in an orderly and logical arrangement. @en

Ministerie
type: Class
subclass of: Bestuurlijke overheidsorganisatie
creator: RS
definition: Editorial: Ministerie is een Overheidsorganisatie die onder de leiding van een minister het regeringsbeleid voorbereidt en uitvoert op een specifiek bestuursgebied.
definition: Editorial: Ministry is a GovernmentOrganization that operates under the direction of a minister and prepares and carries out policy on some domain. @en

Gemeentegebied
type: Class
subclass of: Geopolitiek gebied
creator: RS
definition: Editorial: MunicipalityArea is a GeopoliticalArea that covers the area governed by some MunicipalityGovernment. @en
example: Gemeentebestuur

Gemeentebestuur
type: Class
subclass of: Bestuurlijke overheidsorganisatie
creator: RS
definition: Editorial: Gemeentebestuur is een Overheidsorganisatie die een GeografischGebied bestuurt, meer specifiek een gebied dat kan bestaan uit een Stad, meerdere Dorpen of een stad en meerdere dorpen.
definition: Editorial: MunicipalityGovernment is a GovernmentOrganization that manages some GeographicArea that consists of a City, some Villages or a city and some villages. @en

Naamidentifier
type: Class
subclass of: Identifier-informatieobject
creator: RS
comment: Note that instances of NameIdentifier are not unique and that some entity may have none, one or more NameIdentifiers. @en
definition: NameIdentifier is an IdentifierInformationObject that identifies some Entity in a linguistic form. @en

Nationaliteit
type: Class
subclass of: Relationele eigenschap
subclass of: Restriction
  all values from: Nationaliteitswaarde
  on property: heeft eigenschap of kenmerk
creator: RS
relation: https://zibs.nl/wiki/Nationaliteit-v3.0(2024NL)
comment: Note that some Human can have one, two or even multiple nationalities. @en
definition: Nationality is a RelationalQuality that inheres in some Human and characterizes the Country of which some Human is considered a citizen by e.g. a law or official documentation. @en

Nationaliteitswaarde
type: Class
subclass of: Relationele fysieke waarde
creator: RS
relation: https://zibs.nl/wiki/Nationaliteit-v3.0(2024NL)
definition: Editorial: Instances of NationalityValue express the value(s) of the Quality Nationality that inheres in some Human. @en

Buurman of buurvrouw
type: Class
subclass of: Relationele rol
creator: RS
definition: Editorial: Neighbour is the Role of some Human and corresponds to the mutual relation someone has to some other Human living next door. @en

Niet-samengestelde meeteenheid
type: Class
subclass of: Meeteenheid
creator: RS
definition: SUMO: Instances of this Class are UnitsOfMeasure that are applied to a single dimension, and so are not intrinsically defined by the functional composition of other units. @en

Niet-fysieke endurant
type: Class
subclass of: Endurant
disjoint with: Concrete endurant
creator: RS
definition source: http://www.loa-cnr.it/ontologies/DOLCE-Lite.owl#non-physical-endurant
definition: DOLCE: "An endurant with no mass, generically constantly depending on some agent." @en

Normatieve waarde eigenschap
type: Class
subclass of: Abstracte eigenschap
creator: RS
definition: Editorial: NormativeValueQuality is an AbstractQuality that expresses some quality that is derived, assigned or assessed by Humans via some shared classification and/or normative system. @en
example: Exampes are: the 'severity' of some condition, the 'education level' of some healthcare professional, the 'stage' of some progressive condition, the 'appropriateness' of a movie for some age category, the 'degree of accessibility' of some building for disabled persons, the 'validity' of some passport/drivers license, etc. @en

Normatieve waarde
type: Class
subclass of: Abstracte waarde
creator: RS
comment: An example of a classification system is the European Qualification Framework that can be used to assign some value for the educational level of a nurse. This framework is a norm according to which some normative value is assigned, in this case e.g. 'Level 4'. @en
comment: By definition, instances of NormativeValue do not express values that are intrinsic to any entity. @en
definition: Editorial: Instances of NormativeValue express values of abstract qualities that are derived, assigned or assessed via some shared classification and/or normative system. @en
editorial note: Dus: als de code feitelijk een geschaalde waarde uitdrukt zoals bij decubitusgraden en opleidingsniveaus, gebruik dan NormativeValue en subklassen en eventueel nog ClassificationSystem en subklassen.

Gezin
type: Class
subclass of: Familiegroep
creator: RS
definition: Editorial: Gezin is een FamilieGroep die bestaat uit een of twee ouders en een of meerdere kinderen.
definition: Editorial: NuclearFamily is a FamilyGroup consisting of one or two parents and their child or children. @en

Verpleegkundige
type: Class
subclass of: Zorgprofessional
creator: RS
definition: Wikipedia: Nurse is the HealthcareProfessionRole of a Human who focuses on the care of individuals, families and communities so they may attain, maintain, or recover optimal health and quality of life. @en

Leerling-verpleegkundige
type: Class
subclass of: Leerling-werknemer
creator: RS
definition: Editorial: Leerling-Verpleegkundige is de Rol van een Persoon die in het kader van de Wet Educatie- en Beroepsonderwijs een HBO-duale zorgopleiding volgt en een Arbeidsovereenkomst heeft met een Zorgorganisatie.
definition: Editorial: NurseApprentice is the Role of a Human who works as an Employee for some CareOrganization and receives on-the-job training and supervision while following an accompanying educational program to obtain a professional qualification as Nurse. @en

Verzorgende
type: Class
subclass of: Zorgprofessional
creator: RS
comment: Voor de Nederlandse situatie: een Verzorgende valt, anders dan een Verpleegkundige, niet onder de Tuchtraad en kent geen registratie in het BIG-register.
definition: Editorial: NursingAssistant is the HealthcareProfessionRole of a Human who assist individuals with health care needs with their activities of daily living and who provides basic nursing procedures under the supervision of a nurse or other health care professional. @en
definition: Editorial: Verzorgende is de Rol van een Persoon die verpleegtechnische en verzorgende taken verricht voor een client of een groep clienten binnen een zorginstelling.

Helpende
type: Class
subclass of: Zorgprofessional
creator: RS
definition: Editorial: Helpende is de Rol van een Persoon die binnen een zorginstelling huishoudelijke taken verricht, helpt bij de persoonlijke verzorging van patienten en mede zorg draagt voor hun welzijn.
definition: Editorial: NursingHelper is the Role of a Human who assists with housekeeping within a care instituation, helps with the personal care of patients and who is co-responsible for the general well-being patients. @en

Verpleeghuiszorg
type: Class
subclass of: Langdurige zorg
creator: RS
definition: Verpleeghuiszorg is de subklasse van LangdurigeZorg en omvat het geheel van services, zorgdiensten en verpleging die door een verpleeghuisorganisatie wordt geleverd aan een client die volgens de Wet langdurige Zorg (Wlz) gerechtigd en geindiceerd is om deze diensten te mogen ontvangen.

Verpleeghuisorganisatie
type: Class
subclass of: Zorgorganisatie
creator: RS
definition: Editorial: NursingHomeOrganization is a CareOrganization that provides clustered accomodation, nursing, care and assistance with activities of daily living for Persons who are (temporary) unable to care for themselves due to a handicap, illness or condition. @en
definition: Editorial: VerpleeghuisOrganisatie is een ZorgOrganisatie die zich richt op het geclusterd verlenen van woonruimte en intensieve zorg en verpleging voor Personen die door ziekte of beperking (tijdelijk) niet in staat zijn zelfstandig te wonen.

Voedingsstof
type: Class
subclass of: Biologisch-actieve substantie
creator: RS
comment: Note that all Organisms require some form of Nutrient, though the kind of required and synthesizable nutrient can be specific for some biologic kingdom e.g. Plants versus Animals. @en
definition: Editorial: Nutrient is a BiologicallyActiveSubstance that is necessary for providing energy and maintaining the normal biologic functioning of some Organism. @en

Bezettingseigenschap
type: Class
subclass of: Relationele eigenschap
subclass of: Restriction
  all values from: Bezettingswaarde
  on property: heeft eigenschapswaarde
subclass of: Restriction
  all values from: Onverplaatsbaar artefact
  on property: is eigenschap of kenmerk van
created: 03/2023
created: RS
comment: Note that the OccupancyQuality does not imply that some Organism is necessarily always present in some StationaryArtifact. For example, a patient that occupies some room in a nursing home may be away for a few days. For stating that someone or something is at some place/location, e.g. 'he is in Amsterdam' see onz-g:SpatialQuality. For stating that something is (temporarily) located at some other Object , e.g. 'the book is on the table', see the object property onz-g:hasObjectLocation and the axiom defined for the class onz-g:CorpuscularObject. @en
definition: OccupancyQuality is a RelationalQuality that inheres in StationaryArtifacts and characterizes that some StationaryArtifact such as a room, house, or hospital building is in use by some Organism(s), such as Humans. @en
example: Voorbeelden: 'deze kamer wordt bezet door twee patiënten', 'deze kamer is bezet', 'deze verdieping wordt niet gebruikt', 'het nestkastje is nu in gebruik door twee koolmezen'.

Bezettingswaarde
type: Class
subclass of: Relationele fysieke waarde
subclass of: Restriction
  all values from: Organisme
  on property: heeftBezettingsObject
created: 03/2023
creator: RS
definition: Instances of OccupancyValue express if or in what quantity some Organism occupies/uses some StationaryArtifact. @en

Functie in organisatie-rol
type: Class
subclass of: Sociale rol
creator: RS
comment: Note that OccupationalPositionRoles are dependent on the employment contract that some Human has with some Employer. As such, some Human will no longer carry some OccupationalPositionRole if the employment contract ceases to exist. Also note that some Human can carry both an OccupationalRole and an OccupationalPositionRole. Also, the name or label for these roles can be identical. For instance, someone may have received the education for being a dentist (onz-g:OccupationalRole) and may have the onz-g:OccupationalPositionRole 'dentist' within some CareOrganization. @en
comment: Note that this class can be used as a plugin class for specific positions such as 'senior unit manager B', as defined in existing postional classification schemas. The positional classification schema itself can be specified as an instance of onz-g:ProfessionalQualificationClassificationSystem. @en
definition: Editorial: OccupationalPositionRole is the position that some Human has within the Organization where he/she works and/or has an EmploymentContract. @en
example: Examples: laboratory director, senior researcher, sales representative, unit manager, advisor, etc. @en

Beroeps- of ambachtsrol
type: Class
subclass of: Sociale rol
creator: RS
comment: Note that some Human can be e.g. a nurse or teacher without being employed as such. For occupational positions that depend on the employment and/or employment contract that someone has, we refer to onz-g:OccupationalPositionRole. @en
definition: Editorial: OccupationalRole is the Role of a Human who has had some form of professional training or a specific education and has the credentials to carry out a set of skilled tasks. @en

Oproepkracht
type: Class
subclass of: Werknemer
creator: RS
definition: Editorial: Oproepkracht is de Rol van een Persoon die op afroep arbeid verricht voor een ander Persoon of Organisatie in ruil voor een financiële compensatie en waarbij de onderlinge afspraken, rechten en plichten zijn vastgelegd in een Arbeidscontract.

Opticien
type: Class
subclass of: Beroeps- of ambachtsrol
creator: RS
definition: Editorial: Optician is the Role of a Human who fits and supplies corrective lenses for the correction of a persons vision. @en

Orgaan
type: Class
subclass of: Menselijke anatomische entiteit
creator: RS
definition source: http://purl.org/sig/ont/fma/fma67498
definition: FMA: "Anatomical structure, each instance of which has a maximal complement of instances of two or more types of tissue or one or more types of essential morphologic unit, a predominantly bona fide boundary and intrinsic vasculature and neural network. Examples: liver, lung, kidney, stomach, urinary bladder, gall bladder."

Orgaansysteem
type: Class
subclass of: Menselijke anatomische entiteit
creator: RS
definition source: http://purl.org/sig/ont/fma/fma7149
definition: FMA: "Anatomical structure, each instance of which has as its direct parts instances of one or more organ types which are interconnected with one another by zones of continuity. Examples: nervous system, cardiovascular system, alimentary system." @en

Organisch object
type: Class
subclass of: Corpusculair object
creator: RS
definition: Editorial: OrganicObject is a CorpuscularObject that is considered to come in existence, live and die. This class encompasses Organisms such as 'animal' and 'tree' as well as AnatomicalStructures such as 'liver' and 'leaf'. @en

Organisme
type: Class
subclass of: Organisch object
creator: RS
comment: For a scientifically motivated taxonomy for Organisms we refer to e.g. the NCBI . Here, we included a basic set of subclasses covering only a coarse grained categorization of Organisms. Note that taxonomies for species may follow a different approach for conceptual specialization based on sets and members and not subclasses! For the owl version: http://www.obofoundry.org/ontology/ncbitaxon.html Online browser (no uris): https://www.ncbi.nlm.nih.gov/Taxonomy/Browser/wwwtax.cgi @en
definition: Editorial: Organism is an OrganicObject that can function or act independently. @en

Organisatie
type: Class
subclass of: Groep mensen
subclass of: Restriction
  all values from: Gebied of oppervlak
  on property: opereert in regio
subclass of: Restriction
  all values from: Organisatie
  on property: heeft deel
subclass of: Restriction
  all values from: Class
    union of: Verblijfsobject
    union of: Gebouw
  on property: heeft verblijf in
creator: RS
definition source: https://nl.wikipedia.org/wiki/Organisatie
comment: Note that sub organizations such as 'department' or a 'advisory board' are an Organization as well. For instance, 'Amsterdam Academic Hospital' is an instance of Organization, more specifically an instance of HospitalOrganization. Their Cardiology Department is an instance of CareOrganization while the Bookkeeping Department is an instance of e.g. AccountingOrganization. To define that these instances are part of a larger Organization, we use the property onz-g:hasPart'. This means that the number of different departments of some Organization can be inferred from the number of hasPart properties to another instance classified as Organization. What should or should not be considered a sub organization specifically within the Nursing Home care domain, and on what grounds, should be determined and defined outside the generic ontology. The onz-g ontology is deliberately not restricive in this. @en
definition: Editorial: Organization is a GroupOfHumans that consists of two or more Persons who work together for a particular purpose. @en
definition: Wikipedia: "Organisatie is een doelgerichte samenbundeling van kennis, vaardigheden en kracht tussen meerdere personen die primair middelen en activiteiten aanwendt om te voorzien in de behoefte aan producten en/of diensten in haar omgeving."

Organisatienaam
type: Class
subclass of: Naamidentifier
creator: RS
definition: OrganizationName is a NameIdentifier that identifies some Organization with a linguistic form. @en

Verandering in organisatie
type: Class
subclass of: Menselijke interactie-gebeurtenis
creator: RS
comment: For activities such as 'managing a company' we refer to onz-g:Process and its subclasses. Note that Processes do not have an inherent result that applies to all possible instances of some event concept, while OrganizationalChangeEvents do. @en
definition: OrganizationalChangeEvent is a SocialInteractionEvent where the interactions between Persons and/or Organizations brings about some change in e.g. the operational process, the number of persons working for some Organization and/or the function of some member of the Organization . @en
example: Examples are: company mergers, hiring or firing a person, promoting or demoting an employee, going out of business. @en

Ouder van een kind
type: Class
subclass of: Verwante of familielid
creator: RS
definition: Editorial: Parent is the Role of some Human who has or has had at least one descendent. @en

Participant
type: Class
subclass of: Participatie in proces-rol
creator: RS
comment: The class Participant is further specialized in so called case roles. Case roles are semantic roles played by participants of an event, process or situation. Note that the use of case roles is fully optional but allows for finegrained data retrieval on event participants. Our definition of case roles follows the theory of the linguist Charles Fillmore. In short, case roles describe what role some entity plays in an event, e.g. if it is doing something, undergoing something or using something. In this ontology, we use case role as a specification of the general role Participant. For example, in the sentence 'Mary hit John with vase', we have three participants: Mary, John and a vase. With case roles, you can specify the semantic role of the participants: 'Mary' is the Agent, 'John' the Patient and 'the vase' the Theme. Having case roles for participants of an event allows for specific queries that ask for e.g. all persons participating in some reported agressive incident in the role of AgentCaseRole or PatientCaseRole. In other words: ultimately it allows to specify whether a) some PatientInCare hit a Caregiver or b.) some Caregiver hit a PatientIncare or c) some PatientInCare hit another PatientInCare. Also see: Fillmore, Charles J. (April 1967). "The case for case". Proceedings of the Texas Symposium, on Language Universals. For a fine-grained implementation of case roles, see FrameNet: https://framenet.icsi.berkeley.edu/fndrupal/. @en
comment: This ontology defined a limited set of case roles that specify the more general role Participant. Note that the use of case roles is not mandatory.
definition: Editorial: Participant is a Role that is played by some Entity when involved in some Perdurant. @en

Particular
type: Class
creator: RS
comment: This is the top node of the ontology. @en

Partner
type: Class
subclass of: Verwante of familielid
creator: RS
definition: Editorial: Partner is the Role of some Human and corresponds to the relation someone has to another Human where both contend to share intimacy and significant parts of their personal lives. @en

Pathologisch-anatomische entiteit
type: Class
subclass of: Organisch object
creator: RS
definition source: http://ontology.buffalo.edu/bio/ISMB/ISMB_Bio-ontologies
definition: Editorial: PathologicAnatomicalEntity is an AnatomicalEntity which is not normally found in the Organism of which it is a part, and it is the result of some PathologicProcess. @en
definition: OGMS: "An anatomical structure (FMA) is pathological whenever (1) it has come into being as a result of changes in some pre-existing canonical anatomical structure, (2) through processes other than the expression of the normal complement of genes of an organism of the given type, and (3) is predisposed to have health-related consequences for the organism in question manifested by symptoms and signs."

Pathologisch proces
type: Class
subclass of: Biologisch proces
creator: RS
comment: Note that PathologicalProcesses can be interpreted as a symptom of some disease or syndrom (modeled as onz-g:Qualities), see: onz-g:Symptom (a subclass of onz-g:AbstractRole) and the explanation provided there. @en
definition: Editorial: PathologicProcess is a non canonical BiologicalProcess, i.e. any disordered BiologicalProcess in an Organism as a whole or of multiple Organs or Tissues. @en
example: Examples: 'allergic response', 'necrosis' (process), 'atrophy', 'inflammation', 'cancerogenesis', 'vomiting', 'degeneration', 'atherosclerosis', 'muscle spasms', 'kidney stone formation', etc. @en

Patiens semantische rol
type: Class
subclass of: Semantische rol
creator: RS
comment: Examples: "THE LAKE froze to depths of 6 feet." "Mary hit JOHN with a baseball bat." @en
definition: Editorial: A PatientCaseRole is played by a participant of some Perdurant where participant undergoes/is affected by/changed by some Perdurant in the broadest sense. @en

Cliënt
type: Class
subclass of: Sociale rol
creator: RS
relation: https://zibs.nl/wiki/Patient-v4.3(2024NL)
definition: Editorial: PatientInCare is the Role of a Human who receives professional care, cure and/or assistance with activities of daily life by some CareOrganization and/or Caregiver. @en
example: cliënt, patiënt, zieke, zorgvrager, etc.

Perdurant
type: Class
subclass of: TijdEnPlaatsGebondenEntiteit
subclass of: Restriction
  some values from: Endurant
  on property: heeft participant
subclass of: Restriction
  all values from: Semantische rol
  on property: heeft semantische rol participant
subclass of: Restriction
  all values from: Perdurant
  on property: heeft deel
subclass of: Restriction
  all values from: Concreet object
  on property: heeft perdurantlocatie
creator: RS
comment: As a more formal definition and explanation: Perdurants are only partially present at some point in time and extend in time by accumulating different temporal parts. For example "driving his car to Amsterdam" consist of different temporal parts or phases: driving his car at time 1, 2 and 3. As such, the driving accumulates temporal parts while the driving at time 1 and 2 are no longer present at time 3. In onz-g, Perdurants are further specialized into EventivePerdurant and StativePerdurant following the modeling approach in DOLCE. The difference can be explained and illustrated as follows: -A perdurant is considered an EventivePerdurant if it is cumulative: "selling this car at time 1" and "selling this car at time 2 implies two different sellings. -A perdurant is considered a StativePerdurant if it is not cumulative: "owning this car at time 1" and "owning this car at time 2" does result in one owning a car and not two. Note that expressions in Natural Language that relate to Perdurants show different complementation and aspectual structures that indicate whether some expression is to be understood as e.g. an EventivePerdurant or a StativePerdurant. For example: "John is driving his car" would be considered a Process while "John drove his car to Amsterdam" would indicate an EventivePerdurant. In onz-g, we deliberately abstract over these distinctions and realizations in Natural Language. As a rule of thumb, we define a class such as onz-g:Translocation as a subclass of EventivePerdurant since we consider translocations (e.g. drive, fly, walk) to be intrinsically cumulative. @en
comment: As a more straightforward explanation: Perdurants are things that happen such as 'stitching a wound' and 'hiring a registered nurse'. If the thing that is happening has always and intrinsically a result or leads to some change in the world, it is likely to be an EventivePerdurant. If there is no clear result or change in the world other than not happening at all, it is likely to be a StativePerdurant. For example: -What will always be the case if some [Perdurant] happened? Buying. Result: always implies a change of ownership. Thus: EventivePerdurant. Kill. Result: always implies that someone died. Thus: EventivePerdurant. Increase: Result: always implies that there is more of something than before. Thus: EventivePerdurant. Sleep. No clear result other than not sleeping, no clear change in the world. Thus: StativePerdurant. Meet. No clear result other than not meeting, no clear change in the world. Thus: StativePerdurant. Cry. No clear result other than not crying, no clear change in the world. Thus: StativePerdurant. @en
definition: Editorial: Perdurants are entities that unfold in time and have only temporal parts. @en
example: 'run', 'think', 'inflation', 'volcanic eruption', 'meeting', 'celebrate', 'hospitalize', 'heal', 'election'. @en

Periode van afwezigheid van werk
type: Class
subclass of: Periode
creator: RS
definition: Editorial: PeriodOfAbsenceFromWork is the subclass of ProperPeriod that captures all proper time intervals associated with (partially) being absent from work and/or carrying out tasks while being in employment and/or having some form of labouring contract. @en
example: Voorbeelden zijn: 'zwangerschapsverlof', 'atv-dag', 'adv-dag', 'ziekteperiode', 'ouderschapsverlof', 'vakantiedag', 'met sabbatical', 'onbetaald verlof', etc.

Persoonsnaam
type: Class
subclass of: Naamidentifier
creator: RS
relation: https://zibs.nl/wiki/Naamgegevens-v1.1.1(2024NL)
definition: PersonName is a NameIdentifier that identifies some Human with a linguistic form. @en

Persoonlijk opleidingsplan
type: Class
subclass of: Opleidingsplan
creator: RS
definition: Editorial: PersonalEducationPlan is a EducationPlan where some Employer and Employee state what professional courses and training will be offered to the Employees in order to maintain or improve his educational level, skills and/or and profiency. @en
definition: Editorial: PersoonlijkOpleidingsplan is een Plan waarbij een Organisatie en een Medewerker beschrijven en overeenkomen wanneer en welke opleidingen en cursussen worden gevolgd met als doel het kennisniveau van de Medewerker op peil te houden of verder uit te breiden.

Farmaceutisch artefact
type: Class
subclass of: Artefact
creator: RS
relation: https://zibs.nl/wiki/FarmaceutischProduct-v2.2.1(2024NL)
comment: This class is exclusively for PharmaceuticalArtifacts, i.e. specific drugs that consist of one or more TherapeuticSubstances. For example: Ritalin is an instance of PharmaceuticalArtifact and contains methylfenidate as its TherapeuticSubstance. Note that all Artifacts carry Unity (+U) while Substances do not (-U), hence substances can NOT be subclasses of this class. As a more pragmatic motivation for this distinction: note that some Human may be allergic or have an intolerance for some PharmaceuticalArtifact, but not the TherapeuticSubstance. @en
definition: Editorial: PharmaceuticalArtifact is an Artifact that is made and distributed with the intention to manage, cure, prevent or stabilize some PathologicProcess in a Human.

Apotheker
type: Class
subclass of: Zorgprofessional
creator: RS
definition: Wikipedia: 'Pharmacist is the HealthcareProfessionRole of a Human who is an expert in the use of medicines and deals with the composition, effects, mechanism of action and proper and effective use of drugs.' @en

Concrete endurant
type: Class
subclass of: Endurant
creator: RS
comment: PhysicalEndurant is comparable to ufo:Substantial; note that this class is not in Gufo. Also see: http://dev.nemo.inf.ufes.br/seon/UFO.html#UFO_Substantial_detail The motivation for this class is primarily the differences in Unity criteria which is -U for Substance (water, blood, toothpaste) and +U for Physical Objects (faucet, vein, toothbrush). PhysicalObjects are usually made up by some Substance (in case of artifacts) or consist of some Substance. Substances have no clear boundaries while PhysicalObjects usually do. cf: 'clay' (-U) and 'brick' (+U); 'marble' (-U) and 'marble sculpture' (+U). @en
definition: dolce: "An endurant having a direct physical (at least spatial) quality." @en

Concreet object
type: Class
subclass of: Concrete endurant
disjoint with: Substantie
creator: RS
comment: PhysicalObject is currently specialized in Collections (Objects that have members such as an organization or a forest) and CorpuscularObject (Objects that can have parts that have different properties from the whole, such as a human or a tree). A third potential subclass is currently not modeled in this Ontology since it does not seem to play a role in the Care and Cure domain: SelfConnectedObject. SelfConnectedObject is an Object that carries Unity, has no members and its parts carry the same properties as the whole. Examples are e.g. Iceberg and Ocean. Note the difference with onz-g:Substance (e.g. Water) that carries no Unity. @en
definition: Editorial: PhysicalObject is an Endurant that does not depend on other PhysicalObjects for its existence. @en

Concrete eigenschap
type: Class
subclass of: Eigenschap of kenmerk
subclass of: Restriction
  all values from: Concrete waarde
  on property: heeft eigenschapswaarde
subclass of: Restriction
  all values from: Concrete endurant
  on property: is eigenschap of kenmerk van
creator: RS
comment: Note that PhysicalQualities may also inhere in other PhysicalQualities. For instance, if John has a PressureUlcer (a BiologicalQuality that inheres in some Animal), then some additional quality such as 'DepthQuality' can be used to indicate how deep the ulcer is.
definition: Editorial: PhysicalQuality is a Quality that inheres in PhysicaEndurants and other PhysicalQualities.

Mobiliteitsbeperkend middel
type: Class
subclass of: Fysiek hulpmiddel
creator: RS
comment: Deze klasse bestrijkt die fysieke objecten die primair ontwikkeld zijn om de bewegingsvrijheid van een Persoon te beperken. Voor Handelingen die als 'vrijheidsbeperkend' kunnen worden ingezet verwijzen we naar onz-g:FreedomRestrictionEvent ;voor Artefacten zoals een 'bedhek' die als secundaire functie de vrijheid van een Persoon kunnen beperken, verwijzen we naar onz-g:FreedomRestrictionRole.
definition: Editorial: MobiliteitsBeperkendMiddel is een Hulpmiddel dat er primair voor bedoeld is om een Persoon te beperken in haar bewegingsvrijheid om letsel en/of gevaarlijke situaties voor de Persoon en/of Personen in de omgeving te voorkomen.
definition: Editorial: PhysicalRestraintDevice is a Device that is intended to restrain some Person in order to prevent injury and/or a unsafe situations for the Person herself and/or other Persons. @en
example: Voorbeelden zijn: Zweedse band, Bratexband, polsband, enkelband.

Concrete waarde
type: Class
subclass of: Waarde
creator: RS
comment: Instances of PhysicalValue are atomic regions or qualia in some value space. Our conception of PhysicalValue comes close to dul:PhysicalRegion where the focus is on the region, not the qualia. Due to this difference, we defined no mapping from this class to DOLCE. @en
definition: Editorial: Instances of PhysicalValue express values of physical qualities such as Weight, Acidity and BodyPosition. @en

Fysiologisch proces
type: Class
subclass of: Biologisch proces
creator: RS
definition: Editorial: PhysiologicProcess is a BiologicalProcess that takes place in some Organism and is considered as a normal biological functioning within that Organism. @en
example: Examples are: breathing, urinating, digesting, dying, vomiting, recovering from illness, giving birth/being born, body growth, etc. @en

Fysiotherapeut
type: Class
subclass of: Zorgprofessional
creator: RS
definition: Wikipedia: 'Physiotherapist is the HealthcareProfessionRole of a Human who addresses the illnesses, or injuries that limit a person's abilities to move and perform functional activities in their daily lives.' @en

Plaats- of locatieidentifier
type: Class
subclass of: Identifier-informatieobject
creator: RS
comment: Also see the explanation provided for the class onz-g:LocalizableArea for the use of onz-g:SpatialValue and onz-g:LocalizablePlaceDescription. @en
definition: Editorial: PlaceDescriptionInformationObject is an IdentifierInformationObject that is used to identify some Area by means of some InformationObject, i.e. not a SpatialValue or a GeographicValue. @en
example: Examples are: a postcode, an address, etc. @en

Plan
type: Class
subclass of: Procedure-descriptie
creator: RS
definition source: http://www.ontologyportal.org/translations/SUMO.owl.txt#Plan
definition: sumo: "A specification of a sequence of Processes which is intended to satisfy a specified purpose at some future time." @en

Plant
type: Class
subclass of: Organisme
creator: RS
definition: Editorial: Plant is an Organism that has cellolose cell walls and (usually) chlorophyll. @en

Plant-anatomische entiteit
type: Class
subclass of: Anatomische entiteit
creator: RS
comment: Note that some PlantAnatomicallyEntities are typically associated with having a FoodRole, e.g. 'apple' and 'banana' ( both anatomical reproductive plant entities). Also note that in Natural Language, plant organisms and their anatomical entity may share the same word, e.g. 'apple' refers to 1. the tree species Malus domestica and (onz-g:Plant) 2. a fruit produced by this tree (onz-g:PlantAnatomicalEntity) Likewise: 'banana', 'beet', 'lettuce', 'corn', 'onion', etc. @en
definition: PlantAnatomicalEntity is an OrganicObject "which is generated by coordinated expression of the Plants own genes that guide its morphogenesis; has inherent 3D shape; its parts are connected and spatially related to one another in patterns determined by coordinated gene expression." Definition derived from: The Foundational Model of Anatomy Ontology (FMA). (http://purl.org/sig/ont/fma.owl) @en
example: Examples are apple (the fruit, not the tree), leaf, root, pollen, seed, xylem, etc. @en

Gifrol
type: Class
subclass of: Abstracte rol
creator: RS
comment: Poison is a Role of some PhysicalObject or Substance as most instances are not necessarily, intrinsically and/or for every context and Organism to be considered 'poisonous'. For example, some substance can become poisonous to a Human only if the intake is too high. Likewise, some substances are considered poisonous for e.g. cats but not Humans, e.g. theobromine in chocolate. @en
definition: PoisonRole is a role played by some Substance or PhysicalObject that contains some Substance that is considered poisonous to some Organism in some context and level of exposure. @en

Hoeveelheid lichaamsweefsel
type: Class
subclass of: Menselijke anatomische entiteit
creator: RS
definition source: http://purl.org/sig/ont/fma/fma9637
comment: Note that onz-g:BodyTissue carries no Unity (-U), while onz-g/fma:PortionOfBodyTissue does (+U). @en
definition: FMA: "Anatomical structure, each instance of which has as its parts some cells of predominantly one type with or without intercellular matrix. Examples: portion of epithelium, portion of muscle tissue, portion of connective tissue, portion of neural tissue." @en

Relatieve positie
type: Class
subclass of: Ruimtelijke eigenschap
subclass of: Restriction
  all values from: Relatieve plaats-waarde
  on property: heeft eigenschapswaarde
creator: RS
comment: This Quality is to be used with the quality region pattern to describe e.g. that some PressureUlcer is positioned on the left hip of some patient. Note that e.g. 'left hip' is a datatype string of PositionalValue. Alternatively, see onz-g:PositionalValue for some reusable and standardized vocabularies for specific PositionalValues such as 'dorsal', 'left upper arm', etc. @en
definition: Editorial: PositionalQualities are a RelationalQualities that characterize the orientation or position of some CorpuscularObject or Quality in relation to some (other) CorpuscularObject. @en

Relatieve plaats-waarde
type: Class
subclass of: Plaats- en ruimtewaarde
creator: RS
comment: For a domain specific set of positional values we refer to: Snomed: 106233006 (Topographical modifier); Snomed: 272425003 (General site descriptor); Snomed: 272424004 (Relative sites). @en
definition: Editorial: Instances of PositionalValues are SpatialValues that characterize the orientation of some entity in relation to some other entity, e.g. 'Left', 'Upstairs', 'Dorsal', 'Upper right arm'. @en

Postcodegebied
type: Class
subclass of: Lokaliseerbaar gebied
creator: RS
comment: A PostcodeArea often falls within some GeopoliticalArea such as a District, Municipality or CityOrVillage. Note however that a PostcodeArea has no legislative or adminsitrative body while GeopoliticalAreas do, hence it is a subclass of LocalizableArea and not GeopoliticalArea. @en
definition: PostcodeArea is a LocalizableArea that is identified by some Postcode. @en

Bewerkt voedingsartefact
type: Class
subclass of: Artefact
creator: RS
comment: Note that this class covers dishes, prepared drinks and processed food, i.e. any Substance, PlantAnatomicalStructure and/or AnimalAnatomicalStructure that has been altered in some intentional way by Humans into some Artefact to be ingested. Hence, an apple (the fruit) is NOT considered a PreparedFoodArtifact while 'apple pie' or 'apple juice' is. As an additional example, one can consider 'goat milk' as a PreparedFoodArtifact if it is pasteurized and skimmed, while it should be considered a BodySubstance in the context of mammal anatomy. @en
definition: Editorial: PreparedFoodArtifact is some manipulated OrganicObject and/or Substance intended for ingestion by e.g. Humans in order to be metabolized into energy and body tissue. @en
example: Examples are: cappuccino, lasagne, chocolate, icecream, hotdog, tomato soup, etc. @en

Decubituswond
type: Class
subclass of: Laesie
creator: RS
relation: https://zibs.nl/wiki/DecubitusWond-v3.7(2024NL)
definition source: https://en.wikipedia.org/wiki/Pressure_ulcer
comment: Note that some Human can have one or multiple pressure ulcers at different locations on the body and in different stages of severity. For the overall condition of 'having one or multiple pressure wounds' which is called 'decubitus' in Dutch, we refer to the editor notes provided for the class onz-g:DiseaseOrSyndrome. Note that assigning some severity level (e.g. debitus stage 4) may be applied to the overall condition 'decubitus' (instance of DiseaseOrSyndrome, inhering in some Organism) AND/OR the individual pressure ulcers (also inhering in some Organism). Onz-g allows for both. @en
definition: PressureUlcer is a Lesion that comprises (Wikipedia) "localised damage to the skin and/or underlying tissue that usually occur over a bony prominence as a result of usually long-term pressure, or pressure in combination with shear or friction. " @en
example: 'doorligplek', 'decubituswond', 'doorligwond'.

Preventierol
type: Class
subclass of: Abstracte rol
creator: RS
definition: Editorial: PreventiveRole is a role assigned to some PhysicalObject that has as a secondary function to acts as something intended to prevent some event, process or situation from happening. @en

Procedure-descriptie
type: Class
subclass of: Descriptie
creator: RS
comment: Note that performing or carrying out some Procedure is NOT a Description but a Perdurant. @en
definition: Editorial: Procedure is a sequence-dependent specification of actions involved to achieve some intended result. @en

Participatie in proces-rol
type: Class
subclass of: Rol
creator: RS
definition source: cf: Loebe, F. (2007). Abstract vs. social roles–Towards a general theoretical account of roles. Applied Ontology, 2(2), 127-158. @en
definition: Editorial: A ProcessualRole corresponds to the manner in which a single participant behaves in some Perdurant. @en

Professioneel bewindvoerder
type: Class
subclass of: Beroeps- of ambachtsrol
creator: RS
definition: Editorial: ProfessionalLegalGuardian is the OccupationalRole of a Person who has the legal authority and the corresponding duties to care for the property interests of other Persons. @en

Beroeps- en functieclassificatiesysteem
type: Class
subclass of: Classificatiesysteem
creator: RS
definition: Editorial: Instances of ProfessionalQualificationClassificationSystem are descriptive structures that provide some shared organization and definition of the responsibilities and complexity of some professional position, function or role. @en
example: Voorbeelden: 'functiehuis', 'functieboek', het 'Nederlands Kwalificatieraamwerk', etc.

Functieniveau
type: Class
subclass of: Kwalificatieniveau
subclass of: Restriction
  all values from: Functieniveau-waarde
  on property: heeft eigenschapswaarde
creator: RS
definition: Editorial: ProfessionalQualificationQuality is a NormativeQuality that characterizes e.g. the responsibilities and complexity of some professional position, function or role. @en

Functieniveau-waarde
type: Class
subclass of: Kwalificatieniveau-waarde
creator: RS
definition: Editorial: Instances of ProfessionalQualificationValue express some value that is assigned to symbolize the responsibilities and complexity of some professional position, function or role of some Human. @en
example: 'NLQF_4' @en

Periode
type: Class
subclass of: Perdurant
creator: RS
comment: Een test of iets een onz-g:TemporalMeasure is (dag , week, uur etc) is OF een ProperPeriod: De begin- en eindtijd of de duur staan niet vast, kunnen schuiven en/of kunnen onbekend zijn. Als dat zo is: ProperPeriod. Dus: -een 'week' in de zin van 'zeven dagen van 24 uur' is een TemporalMeasure. -een 'week' in de zin van een 'werkweek' die kan verschillen in 'duur' is een ProperPeriod. Let ook op het verschil met StativePerdurants.
definition: "A temporal entity with non-zero extent or duration, i.e. for which the value of the beginning and end are different."
example: Examples are: 'reces', 'summer', 'fiscal year', 'parental leave', 'Christmas holidays', 'a sick day', 'work week'. @en
example: Voorbeelden: 'verlofperiode', 'werkweek', 'ziektedag', 'lunchpauze', 'boekjaar', 'zomer/zomerperiode', 'Kerstvakantie', etc.

Beschermproces
type: Class
subclass of: Intentioneel proces
creator: RS
definition: Editorial: ProtectingProcess is an IntentionalProcess that is carried out by some CognitiveAgent with the intention to decrease the chance of some Damaging or Injuring or Destruction to happen to some PhysicalObject, such as Humans and Artifacts. @en
example: 'toezicht', 'bewaken', 'beschermen', etc.
example: Examples: guarding.v, safeguard.v, shield.v, 'she protected him from falling down the stairs', 'the art collection was kept safe during the war', 'the surgeon was put under police protection'. @en

Eiwit
type: Class
subclass of: Voedingsstof
creator: RS
definition: Editorial: Protein is a Nutrient that consists of organic compounds that are used by some Organism to maintain normal biological functions. @en

Provinciegebied
type: Class
subclass of: Geopolitiek gebied
creator: RS
definition: Editorial: ProvinceArea is a GeopoliticalArea that covers the area governed by some ProvinceGovernment. @en

Psychiater
type: Class
subclass of: Arts
creator: RS
definition: Wikipedia: Psychiatrist is a MedicalDoctor who specializes in psychiatry, the branch of medicine devoted to the diagnosis, prevention, study, and treatment of mental disorders. @en

Psychologisch proces
type: Class
subclass of: Biologisch proces
creator: RS
definition: Editorial: PsychologicalProcess is a BiologicalProcess which takes place in the brain of some Animal and is primarily unintentional. @en

Psychologische of cognitieve eigenschap
type: Class
subclass of: Organische eigenschap
creator: RS
comment: Note that specific PsychologicalQualities such as 'happy', 'confused', 'angry', 'irritated' can be modeled as individuals of this class. Alternatively, we refer to SNOMED for a vocabulary of specific psychological qualities. @en
definition: Editorial: PsychologicalQuality is a BiologicalQuality that characterizes the mental, behavioural and/or cognitive state of some Organism. @en

Openbaar gebied
type: Class
subclass of: Geopolitiek gebied
creator: RS
definition: Editorial: PublicArea is a GeopoliticalArea that is owned by some GovernementOrganization. @en

Kwalificatieniveau
type: Class
subclass of: Normatieve waarde eigenschap
creator: RS @en
definition: QualificationLevelQuality characterizes the level of competence, knowledgeability and skills that is obtained by some Human and/or that is required to carry out some task. @en

Kwalificatieniveau-waarde
type: Class
subclass of: Normatieve waarde
creator: RS
definition: Instances of QualificationLevelValue express values for the level of competence, knowledgeability and skills that is obtained by some Human and/or that is required to carry out some task. @en

Eigenschap of kenmerk
type: Class
subclass of: TijdEnPlaatsGebondenEntiteit
subclass of: Restriction
  all values from: Eigenschap of kenmerk
  on property: heeft eigenschap of kenmerk
subclass of: Restriction
  all values from: Waarde
  on property: heeft eigenschapswaarde
creator: RS
comment: For instantiating Qualities with the QualityRegion design pattern, we refer to onz-g:QualityValue for an explanation and some examples. @en
label: Quality @en
definition: Editorial: Qualities are entities that can be observed, experienced or measured and that are dependent on some other entity to exist. @en
example: length, color, size, weight, fragility, happiness, dead, blind, alive, damagedness, having some disease, @en

Waarde
type: Class
subclass of: Abstracte entiteit
subclass of: Restriction
  all values from: Meet- of vaststelgebeurtenis
  on property: is vastgesteld waarderesultaat van
disjoint with: Meeteenheid
creator: RS
comment: Say we want to state that some person weighs 54 kilo. There are basically two options to model this: directly with a data property or via reification of the quality value. In the case of a data property, we would say someting like : DataPropertyDomain (onz-g:hasWeight onz-g:Person) DataPropertyRange (onz-g:hasWeight xsd:integer) The use of the 'hasWeight' dataproperty has now been restricted by defining a specific domain and range. However, the meaning of the hasWeight property may vary within and across domains while the specific values may also be expressed in other data types. This approach hampers a.) interoperabilty across different models and b.) the annotation of heterogeneous data. With reification via QualityValues, we make the shared conceptualization of Weight explicit. With this, we can say that Person has quality Weight and that Weight has a MassValue. The data value of this MassValue is '54'. Also, the ontology provides units of measure that allow to define that '54' uses 'kilo' as unit of measure. If another person has the same MassValue of 54 but measured in 'stone', we know that we are still talking about a MassValue but the difference in UnitOfMeasure indicates that the two '54' data values point at a different weight. All subclasses of QualityValue and Quality will adhere to this pattern. @en
definition: Editorial: Instances of QualityValue are the reified values of some quality that itself inheres in some SpatioTemporalParticular. @en

Kwantitatief-meetbare eigenschap
type: Class
subclass of: Interne eigenschap
subclass of: Restriction
  all values from: Class
    union of: Abnormale morfologische eigenschap
    union of: Concrete endurant
  on property: is eigenschap of kenmerk van
creator: RS
definition: QuantitativeMeasurementQuality is an InternalQuality that characterizes quantifiable attributes of some Endurant such as 'mass', 'temperature' and 'density'. @en
editorial note: (qudt:QuantityKind)

Kwantificeerbare meetwaarde
type: Class
subclass of: Interne fysieke waarde
subclass of: Restriction
  all values from: Meeteenheid
  on property: heeft meeteenheid
creator: RS
comment: Instances of QuantitativeMeasurementValue are derived with some measurement device and may or may not be the result of some action of a cognitive agent. In other words: some oxygen saturation value may be outputted by a permanent body sensor or measured by an intentional human action. @en
comment: Instances of QuantitativeMeasurementValue are usually expressed in combination with some individual UnitOfMeasure. For example, '100 meters' combines a datatype for some LengthQuality combined with a specific UnitOfMeasure ('meter') used to express Lenght measurements. This ontology does NOT make any formal commitment towards combining QuantitativeMeasurementValues with some UnitOfMeasurement; this implies that the model is open to nominal quantity values such as 'a lot', 'heavy', and 'cold'. @en
definition: Editorial: Instances of QuantitativeMeasurement Value express the quantity values of physical qualities such as Length, Mass and Volume as derived by some measurement process or action. @en

Verandering in hoeveelheid
type: Class
subclass of: Interne verandering
creator: RS
definition: QuantityChangeEvent is the subclass of InternalChange where the quantity of some Entity changes. @en
example: 'toename', 'afnemen', 'fluctueren', 'verhogen', 'verminderen', 'inkrimpen', 'uitbreiden', etc.
example: Examples: increase, decrease, fluctuate, plummet, diminish, rise, enlarge, going up and down. @en

Bon
type: Class
subclass of: Fysiek financieel document
creator: RS
definition: Editorial: Receipt is a FinancialDocument that contains a written acknowledgment that some article or service has been received and exchanged in return for some amount of money. @en

Ontvanger semantische rol
type: Class
subclass of: Semantische rol
creator: RS
comment: Examples: "Yesterday, Mary mailed the letter to JOHN." "JOHN received a letter in the mail." @en
definition: Editorial: A RecipientCaseRole is played by a participant of some Perdurant and is the intended target of some transfer service. @en

Revalidatiecentrum
type: Class
subclass of: Zorgorganisatie
creator: RS
definition: Editorial: RehabilitationCentre is a CareOrganization focused on the diagnosis and treatment of Persons with some physical impairment or disability. @en
definition: Editorial: RevalidatieCentrum is een Zorginstelling gericht op het diagnosticeren en behandelen van Personen met een functiebeperking.

Relationele fysieke waarde
type: Class
subclass of: Concrete waarde
creator: RS
definition: Editorial: Instances of RelationalPhysicalValue indicate the value for some RelationalQuality. @en
example: Example values may include: 'on the left', 'connected', 'fused', etc. @en

Relationele eigenschap
type: Class
subclass of: Concrete eigenschap
creator: RS
definition: Editorial: RelationalQuality is a PhysicalQuality that some Entity inheres through some relationship that it bears to another Entity or Entities. @en
example: Examples are: 'barefoot', 'motionless', 'employed', 'high priority', 'on the left', 'false', etc. @en

Relationele rol
type: Class
subclass of: Rol
creator: RS
definition source: Loebe, F. (2007). Abstract vs. social roles–Towards a general theoretical account of roles. Applied Ontology, 2(2), 127-158. @en
comment: The main discriminative feature of Relational Roles is that they are dependent on the existence of and relation to another Role while this dependence is mutual. For example, carrying the role Brother can only exist and is dependent on the existence of another entity that carries the role Brother. A Natural Language test would be: 'you can not be an X (friend/employer/...) on your own or without some someone else being X or Y (friend/employee)'. @en
definition: Loebe (2007): A RelationalRole corresponds to the way in which some Entity participates in some relation. @en

Verwante of familielid
type: Class
subclass of: Relationele rol
creator: RS
comment: The role Relative is broadly defined and is intended to capture all roles someone can carry in the context of what can be considered 'family' across different cultures. @en
definition: Editorial: Relative is the Role of some Human and corresponds to the kinship someone carries in relation to some other Human, whether through common ancestry, marriage or adoption. @en

HuurBedrag
type: Class
subclass of: Financiële entiteit
created: 11-23
creator: RS
definition: Rent is the subclass of FinancialEntity that comprises fees for using something that you do not own for some period of time. Usually, some kind of contract exists that defines the fee, the used object and any terms and conditions related to the owner, the rented object, the renter and the fee. @en

Rapport
type: Class
subclass of: Fysiek document
creator: RS
definition: Editorial: Report is a physical or digital Document that describes the findings of a study or experiment, or a series of observations. @en

Verzorgingshuisorganisatie
type: Class
subclass of: Zorgorganisatie
creator: RS
definition: Editorial: ResidentialCareHome is a CareOrganization that provides clustered accomodation, care and assistance with activities of daily living for Persons who are (temporary) unable to care for themselves due to a handicap, illness or condition. @en
definition: Editorial: VerzorgingshuisOrganisatie is een ZorgOrganisatie die zich richt op het geclusterd verlenen van woonruimte, zorg en begeleiding bij het uitvoeren van dagelijkse activiteiten voor Personen die door ziekte of handicap (tijdelijk) niet in staat zijn zelfstandig te wonen.

Weg of straat
type: Class
subclass of: Landtransit-areaal
creator: RS
definition: sumo: Roadway is the subclass of LandTransitArea "that are areas intended for surface travel by self-powered, wheeled vehicles, excluding those that travel on tracks. Roadways have been at least minimally improved to enable the passage of vehicles. Roadways include dirt and gravelled roads, paved streets, and expressways."
example: 'weg', 'straat', 'pad', etc.

Rol
type: Class
subclass of: Niet-fysieke endurant
subclass of: Restriction
  some values from: Endurant
  on property: is rol gedragen door
creator: RS
comment: Typical examples of roles are 'student', 'manager', 'sister', 'food', 'symptom'. @en
definition: Editorial: A Role is a NonPhysicalObject that is played by some Endurant and depends on some context.

Kamer of ruimte
type: Class
subclass of: Onzelfstandig vertrek of ruimte
creator: RS
comment: We refer to SnoMed for a subhierarchy of rooms such as kitchen, bedroom and bathroom; see provided URL. @en
definition: Editorial: Room is a StationaryArtifact consisting of walls, a floor and a ceiling and is a functionally dependent and located in a Building. @en

Veiligheidsgordel
type: Class
subclass of: Engineering component
creator: RS
comment: Zie ook de uitleg bij de klasse onz-g:Bedrail.

Gedetacheerde
type: Class
subclass of: Werker
creator: RS
definition: Editorial: Gedetacheerde is de Rol van een persoon die in dienst is van een Organisatie en wordt uitgeleend aan een andere Organisatie om daar voor een bepaalde tijd werkzaamheden te verrichten.
definition: Editorial: SecondmentWorker is the Role of a Human who is employed by some Organization while being assigned to another Organization for some period of time to carry out some task. @en

ServiceKosten
type: Class
subclass of: Financiële entiteit
created: 11-23
creator: RS
definition: ServiceCharge is the subclass of FinancialEntity that comprises fees for using some (mandatory) service, usually in addition to renting or buying some object. @en
example: Examples: "If you buy concert tickets from this box office, there will be a 3,- euro service charge." @en

Pubieke dienst-organisatie
type: Class
subclass of: Organisatie
creator: RS
definition: Editorial: PubiekeDienstOrganisatie is een Organisatie die publieke diensten levert of een overheidsbeleid uitvoert en daarbij (financiele) verantwoording aflegt en/of rapporteert bij een BestuurlijkeOverheidsOrganisatie.
definition: Editorial: ServiceOrganization is an Organization that provides some public service and is regulated by the Government or carries out some Governmental policy. @en

Service- Of Dienstverlening
type: Class
subclass of: Menselijke interactie (proces)
creator: RS
comment: Note that this class encompasses commercial and non-commercial services, meaning that a (financial) compensation is not mandatory. @en
definition: ServiceProcess is the subclass of SocialInteractionProcess where some Human and/or Organization performs a service for another Human and/or Organization. @en

Broer of zus
type: Class
subclass of: Verwante of familielid
creator: RS
definition: Editorial: Sibling is the Role of some Human and corresponds to the relation someone has to another Human if both share the same Parents. @en

Situatie
type: Class
subclass of: Statische perdurant
creator: RS
comment: An example may clarify what a Situation is and how it differs from Event and Process concepts : If we have an event such as: "Yesterday, John bought the car from Mary", we know that there are two different situations in reality: sit. 1: before yesterday, Mary owns the car and John didn't sit. 2: today, Mary no longer owns the car while John does. Situation 1 and 2 can be described as two different gufo:Situations: "Johns owning of this car after yesterday" and "Marys owning of this car before yesterday". Note how this is different from the concept "OwningACar" that would be considered as a subclass of StativePerdurant in onz-g. Typically, instantiated situations take the form of a named graph that consists of triples that describe what the partial and time-bounded situations is. To this end, Gufo for instance, provides a limited set of typed situations. Another, somewhat similar approach is suggested in the ESO and CEO ontologies where the situations are anonymous but 'bounded' to the event that implies some change in the world. See for more details: -Segers, R., Vossen, P., Rospocher, M., Serafini, L., Laparra, E., & Rigau, G. (2015). Eso: A frame based ontology for events and implied situations. Proceedings of MAPLEX, 2015. @en
comment: This class is added in case there is a (future) need to model and instantiate situations directly. @en
definition: Editorial: A Situation is a StativePerdurant that corresponds to partial and time-bounded representation of a piece of reality or state of things in the world. @en
example: An example of a Situation is 'Mary's owning a Ford between 2010 and 2011'. @en

Maat
type: Class
subclass of: Kwantitatief-meetbare eigenschap
subclass of: Restriction
  all values from: Maatwaarde
  on property: heeft eigenschapswaarde
creator: RS
comment: Note that the actual values of some SizeQuality such as "8" or "large" are modeled with a SizeQualityValue. @en
definition: SizeQuality is a QuantitativeMeasurementQuality that characterizes the physical magnitude of some PhysicalEndurant. @en
example: Examples include: "These shoes are size 11", "We need a larger size dressing for that wound", "This is an average-sized nursing home", etc. @en

Maatwaarde
type: Class
subclass of: Kwantificeerbare meetwaarde
creator: RS
definition: Editorial: Instances of SizeValue express the values of the PhysicalMeasurementQuality SizeQuality. @en
example: Examples include: These shoes have a size "11"; this is a "small"-sized dog breed, etc. @en

Maatschappelijk informatieobject
type: Class
subclass of: Abstract informatieobject
creator: RS
definition: Editorial: SocialInformationObject is an InformationObject that expresses knowledge, facts, statements or regulations on some aspect or aspects of Human interaction. @en
example: Examples are: 'the content of some law', 'the service agreement of your car dealer', 'a collective labour agreement', 'the content of an employment contract', etc. @en

Menselijke interactie-gebeurtenis
type: Class
subclass of: Intentionele gebeurtenis
creator: RS
comment: Note that not all events where Humans may interact are therefore necessarily to be interpreted as a SocialInteractionEvent. This class defines events where the focus is on some intentional interaction between humans or groups of humans only and where there is some inherent change in the world as a result of the event other than 'not happening'. As some contrastive examples of happenings that (may) involve some (human) interaction but are not considered subclasses of SocialInteraction: - onz-g:Meeting is not an SocialInteractionEvent but considered a subclass of SocialInteractionProcess since there is no inherent result that holds for all instances of onz-g:Meeting besides of 'meeting is over/does no longer exist'. - onz-g:Killing and onz-g:Injuring are subclasses of InternalChange and not SocialInteractionEvent as a.) they not necessarily involve only Humans interacting and b.) not all injuring and killing events are intentional. @en
definition: Editorial: SocialInteractionEvent is an IntentionalEvent where Humans interact with eachother with some inherent result. @en
example: Examples are: 'John sold a car to Mary', 'John got fired/hired/promoted', 'she debrided the wound carefully', 'He slapped her in the face', etc. @en

Menselijke interactie (proces)
type: Class
subclass of: Intentioneel proces
creator: RS
comment: Note that not all processes where Humans may interact are therefore necessarily to be interpreted as a SocialInteractionProcess This class defines processes where the focus is on some intentional interaction between humans or groups of humans only and where there is, for all instances, no inherent change in the world as a result of the process other than 'not happening'. @en
definition: Editorial: SocialInteractionProcess is an IntentionalProcess where Humans interact with eachother without an inherent result that holds for all instances of this class. @en

Sociale rol
type: Class
subclass of: Rol
creator: RS
definition source: Loebe, F. (2007). Abstract vs. social roles–Towards a general theoretical account of roles. Applied Ontology, 2(2), 127-158. @en
definition: Loebe (2007): A SocialRole corresponds to the involvement of a social object within some society. @en
definition: dolce: A role created and maintained by a society. @en

Ruimtelijke eigenschap
type: Class
subclass of: Relationele eigenschap
subclass of: Restriction
  all values from: Plaats- en ruimtewaarde
  on property: heeft eigenschapswaarde
creator: RS
definition: Editorial: SpatialQuality is a RelationalQuality that inheres is SpatioTemporalParticulars and characterizes the position of some entity in relation to some other SpatioTemporalParticular. @en

Plaats- en ruimtewaarde
type: Class
subclass of: Relationele fysieke waarde
creator: RS
definition: Editorial: Instances of SpatialValue characterize the position of some entity in a spatial dimension.

TijdEnPlaatsGebondenEntiteit
type: Class
subclass of: Particular
creator: RS
label: SpatioTemporalParticular @en
definition: Editorial: Instances of SpatioTemporalParticular are entities that exist in time and space. @en

Echtgenoot of echtgenote
type: Class
subclass of: Partner
creator: RS
definition: Editorial: Spouse is the Role of some Human and corresponds to the relation someone has to another Human where both contend to share intimacy and significant parts of their personal lives, while this bond is grounded in some Contract. @en

Onverplaatsbaar artefact
type: Class
subclass of: Artefact
subclass of: Restriction
  all values from: Lokaliseerbaar gebied
  on property: heeft lokaliseerbaar gebied
subclass of: Restriction
  all values from: Onzelfstandig vertrek of ruimte
  on property: heeft deel
creator: RS
comment: Note that StationaryArtifact and its subclasses are restricted to Artifacts only. Objects that have a fixed location but are not man-made (a river, a rock formation) are NOT StationaryArtifacts. Also note that 'parts' of StationaryArtifacts such as a porch or a room are also StationaryArtifacts as they have a fixed spatial location (and are located within some other StationaryArtifact). Also note that NOT all possible parts or components of some StationaryArtifact are therefore StationaryArtifacts as well. See also e.g. onz-g:Device, onz-g:EngineeringComponent and onz-g:Artifact. @en
definition: sumo: StationaryArtifact is an Artifact that has a fixed spatial location. @en
example: Examples are: house, bridge, toll booth, porch, canal, room, etc. @en

Statische perdurant
type: Class
subclass of: Perdurant
creator: RS
comment: Also see the definition and explanation provided for the class onz-g:Perdurant on how StativePerdurant and EventivePerdurant are discriminated, including some simple Natural Language tests that help to make this distinction. @en
comment: In onz-g, we currently make no formal distinction between States (homeomeric) and Processes (not-homeomeric) as this distinction is often difficult to grasp and may not add expressivity or enhance reasoning on data for the Cure domain. In short: homeomericity has to do with whether 'parts' of some StativePerdurant are identical to the 'whole' or not. For instance, every temporal part of 'sitting' will be sitting while temporal parts of 'managing' can be 'hiring employees', 'chairing a meeting', 'writing a mission paper', etc. @en
definition: Editorial: A StativePerdurant is a Perdurant that is not cumulative and does not intrinsically imply some change in the world/state of affairs. @en
example: Examples are: cry.v, breathe.v, erosion.n, grow.v, imprisonment.n, abducted.a, etc @en
example: huilen.v, erosie.n, ademhalen.v, werken.v, ontvoerd.a, vergadering.n, managen.v, zitten.v, verblijven.v, verblijf.n, assisteren.v, etc.

Subjectieve waarde
type: Class
subclass of: Abstracte waarde
creator: RS
comment: An example is some recommandation value with data values such as 'high', 'yes', 'not likely', 'no answer', '7'. Note that the 'subjective' in SubjectiveValue does not claim anything on the truth of the values but models those values that are NOT derived with some standardized classification scale (NormativeValue) or measured with some measurement device (QuantityValue). By definition, instances of SubjectiveValue do not express values that are intrinsic to any instance of an owl:Thing. @en
definition: Instances of SubjectiveValue represent values that are derived and assigned by some Human on the basis of some subjective assessment and/or judgement of some Quality. @en
example: Examples include specific values for e.g. 'satisfaction', self-assessment', 'recommandation', etc. @en

Substantie
type: Class
subclass of: Concrete endurant
subclass of: Restriction
  all values from: Corpusculair object
  on property: heeft objectlocatie
creator: RS
comment: Note the difference with gufo:Quantity (an objectified portion of mass) being +U and onz-g:Substance (-U). Portions of substance are countable and +U while substances itself are not. cf: 'lithium' (-U)/ 'insulin' (-U) and 'lithium pill' (+U), 'insulin dose' (+U). @en
comment: Substance carries no Unity (-U), meaning that instances can be considered as a mass and are typically not countable. For instance: clay plus clay is just more clay and not two clay, while cat (+U) plus cat is two cats. When in doubt, some Natural Language checks for Unity on a candidate substance (X) can be of help: -Can I count instances of X? If no -> likely -U. -Can I merge two instances of X into a new mass without distinctive parts? If yes -> likely -U. @en
definition: sumo: Substance is a PhysicalObject "in which every part is similar to every other in every relevant respect. More precisely, something is a Substance when it has only arbitrary pieces as parts - any parts have properties which are similar to those of the whole. Note that a Substance may nonetheless have physical properties that vary. For example, the temperature, chemical constitution, density, etc. may change from one part to another. An example would be a body of water." @en
example: Examples are: water, blood, clay, gold, wood, saliva, glue, vomit, sugar. @en

Symptoom
type: Class
subclass of: Abstracte rol
creator: RS
comment: An example is the DiseaseOrSyndrom 'fever' that can have the role Symptom if associated with some other DiseaseOrSyndrom such as flue, meningitis and malaria. @en
definition: Editorial: SymptomRole is a role assigned to some Quality that a Human experiences or detects in a bodily function and that is associated with some disease or syndrome. @en

Tarief
type: Class
subclass of: Financiële entiteit
created: 08-23
creator: RS
definition: Tarief is een (genormaliseerde en/of gestandaardiseerde) geldelijke vergoeding voor een geleverde dienst of product volgens een bepaalde eenheid van levering.
definition: Tariff is a (normalized and/or standardized) financial compensation related to some unit of measure for provided goods or services. @en
example: Examples: 'we charge 100 euro a day for renting a mid-sized car'; 'our tariff is 100 euros for a 45 minutes consultation'. @en

Techniekdescriptie
type: Class
subclass of: Methode
creator: RS
definition: Definition: Technique is a description of the way to carry out a particular task or execute a method or procedure. @en

Temperatuur
type: Class
subclass of: Kwantitatief-meetbare eigenschap
subclass of: Restriction
  all values from: Temperatuurwaarde
  on property: heeft eigenschapswaarde
creator: RS
definition: Editorial: TemperatureQuality is a QuantitativeMeasurementQuality that characterizes the temperature of some PhysicalObject. @en

Temperatuurwaarde
type: Class
subclass of: Kwantificeerbare meetwaarde
creator: RS
definition: Editorial: Instances of TemperatureValue express the quantity values of the physical quality Temperature. @en

Tijdspuntwaarde
type: Class
subclass of: Duur- en tijdswaarde
creator: RS
definition: Instances of TemporalInstantValue express some time value with no duration and/or extent. @en

Temporele eigenschap
type: Class
subclass of: Eigenschap of kenmerk
subclass of: Restriction
  all values from: Duur- en tijdswaarde
  on property: heeft eigenschapswaarde
creator: RS
definition: Editorial: TemporalQuality is a Quality that inheres in Perdurants and other Qualities. @en
example: Examples are: some Perdurant 'happened', 'took place', 'unfolded' during/at some time. @en

Duur- en tijdswaarde
type: Class
subclass of: Waarde
creator: RS
comment: Instances of TemporalValue are atomic regions or qualia in some value space. Our conception of TemporalValue comes close to dul:TemporalRegion where the focus is on the region, not the qualia. @en
comment: Note that TemporalValues are only to be used for time expressions via a quality region pattern. Alternatively, there is a set of datatype properties for time. @en
definition: Editorial: Instances of TemporalValue express values of temporal qualities such as durations and timepoints. @en

Uitzendkracht
type: Class
subclass of: Werker
creator: RS
definition: Editorial: TemporaryWorker is the Role of a Human who is mediated by some temporary employment agency that sends her to work in different organizations for a limited period of time. @en
definition: Editorial: Uitzendkracht is de rol van een Persoon die namens een Uitzendbureau arbeid verricht bij een Onderneming en daarbij onder toezicht en leiding van deze Onderneming staat.

Thema semantische rol
type: Class
subclass of: Semantische rol
creator: RS
comment: Examples: "Yesterday, Mary mailed THE LETTER to John." "MARY flew to New York in the newest Airbus." @en
definition: Editorial: A ThemeCaseRole is played by some Object participating in some Perdurant as the thing that is transferred. @en

Therapeutische interventie
type: Class
subclass of: Menselijke interactie-gebeurtenis
creator: RS
relation: https://zibs.nl/wiki/VerpleegkundigeInterventie-v4.1(2024NL)
relation: https://zibs.nl/wiki/Verrichting-v5.4.1(2024NL)
comment: Cure related extensions for TherapeuticInterventions can be placed here. For this version of the onz-g, we incorporated a limited number of cure related interventions that were identified for the current use case of Quality of Care in Dutch nursing homes. We refer to e.g. SnoMed for an extensive classification of TherapeuticInterventions. @en
comment: Note that 'providing assistence with activities of daily living' is NOT considered a TherapeuticIntervention as its prime focus is not on alleviating or curing some DiseaseOrSyndrome despite that experiencing assistence may have a therapeutic effect on the PatientInCare. @en
definition: Editorial: TherapeuticIntervention is any SocialInteractionEvent carried out with the intention to cure, alleviate or reduce (the symptoms of) some DiseaseOrSyndrome. @en

Therapeutische substantie
type: Class
subclass of: Biologisch-actieve substantie
creator: RS
comment: In onz-g, we included a small set of therapeutic substances that are deemed important for the domain. For a structured set of (potential) subtypes to extend the hierarchy for TherapeuticSubstance, we refer to SnoMed and the NCIT: http://purl.bioontology.org/ontology/SNOMEDCT/410942007 (Drug or Medicament) http://ncicb.nci.nih.gov/xml/owl/EVS/Thesaurus.owl#C1909 ( Pharmacologic Substance) @en
comment: Note that this class is for substances; for the medical products made from or with these substances, we refer to onz-g:PharmaceuticalArtifact. Some TherapeuticSubstances will be man-made and could therefore erroneously be interpreted as Artifact; note however that not all man-made PhysicalObjects are necessarily Artifacts. Note that instances of TherapeuticSubstance are not always necessarily and intrinsically therapeutic, but they can function as such within a specific context. Depending on the domain and the specific information need, one can consider e.g. 'lithium' to be an instance or subtype of ChemicalSubstance, TherapeuticSubstance or both. @en
definition: Editorial: TherapeuticSubstance is a BiologicallyActiveSubstance that may have an effect in the treatment, stabilization or prevention of some PathologicalProcess in some Organism. @en
example: Examples are: antibiotic substance, quinine, acetylsalicylic acid, lithium, iodine, etc. @en

Toxine
type: Class
subclass of: Biologisch-actieve substantie
creator: RS
definition: Editorial: Toxin is a poisonous BiologicallyActiveSubstance that is produced within a Cell or Organism, or man-made as a synthetic analogue. @en
example: Examples are: botulinum toxin produced by the Bacterium Clostridium botulinum; staphylococcal enteretoxin B that is produced by the bacterium Staphylococcus aureus. @en

Trainee
type: Class
subclass of: Werknemer
creator: RS
definition: Editorial: Trainee is de Rol van een Persoon die na het behalen van een opleidingskwalificatie in dienst is van een Organisatie en binnen of namens deze Organisatie werkzaamheden verricht en specifieke aanvullende beroeps- of functiegerichte trainingen volgt.
definition: Editorial: Trainee is the role of some Human who undergoes training for a particular job or profession within some Organization, usually after having graduated from some educational program. @en

Translocatie
type: Class
subclass of: Eventieve perdurant
creator: RS
comment: For body motions that are not focused primarily on changing location, we refer to X and its subclasses. Examples of body motions are: 'raise arm', 'bend knee', etc. @en
definition: Editorial: Translocation is an EventivePerdurant where some PhysicalObject moves from one location to another location. @en
definition: http://www.ontologyportal.org/translations/SUMO.owl.txt#Translocation
example: examples: 'arrival.n', 'depart.v', 'moving residence.v', 'evacuate.v', 'trespassing.v', 'falling.v', 'dropping an object.v', 'travel.n', 'dispersal.n', etc. @en

Transportmiddel
type: Class
subclass of: Fysiek hulpmiddel
creator: RS
definition: Editorial: TransportationDevice is a Device that acts as an Instrument in the Translocation of PhysicalObjects from one Location to another Location. @en
definition: Editorial: Transportmiddel is een fysiek en mensgemaakt Middel dat wordt gebruikt om FysiekeObjecten zoals personen en goederen van een Locatie naar een andere Locatie te verplaatsen.

Bratexband
type: Class
subclass of: Mobiliteitsbeperkend middel
creator: RS
definition: Editorial: Bratexband is een MobiliteitsBeperkendMiddel waarbij een Persoon door een band om een deel van de torso wordt gefixeerd aan een bed of stoel.
example: 'Bratexband', 'onrustband'.

Valutatype-eenheid
type: Class
subclass of: Niet-samengestelde meeteenheid
creator: RS
definition: Editorial: Instances of UnitOfCurrency are units for money in common use, especially for people in some nation. @en

Tijdsduureenheid
type: Class
subclass of: Niet-samengestelde meeteenheid
creator: RS
comment: Also see: onz-g:TemporalValue @en
comment: Domain-specific units of volume such as '40 hour workweek' and '36 hour workweek' will also be instances of this class. This allows to say e.g. that some institution A has three employees with a fulltime contract using '36 hour workweek' as unit of measure while institution B has three employees with a fulltime contract but uses the unit of measure '40 hour workweek'. Note that the instance '36 hour workweek' has two different meanings: a.) a unit of duration and b.) a specific DurationValue. The difference can also be illustrated with two contrastive example sentences: 'We employ a 36 hour workweek for deriving how many full time positions we have at this institution" versus 'Mary has a 36 hour workweek but her collegue works only 12 hours a week" (duration value) @en
comment: Instances of this class can be used to form instances of time durations; the unit 'day' can be used to form 'six days'. Note that the ontology will enable to express that 'six' is dataValueType of some DurationValue for which the UnitOfDuration 'day' is used. @en
definition: Editorial: UnitOfDuration represents the standardized units of time such as 'minute' and 'hour'. @en

Lengte-eenheid
type: Class
subclass of: Niet-samengestelde meeteenheid
creator: RS
definition: Editorial: UnitOfLength represents the standardized units of length such as 'inch' and 'nanometer'. @en

Gewichtseenheid
type: Class
subclass of: Niet-samengestelde meeteenheid
creator: RS
definition: Editorial: UnitOfMass represents the standardized units of mass such as 'kilo' and 'ounce'. @en

Meeteenheid
type: Class
subclass of: Abstracte entiteit
subclass of: Restriction
  all values from: Waarde
  on property: is meeteenheid van
creator: RS
definition: SUMO: A standard of measurement for some dimension. For example, the Meter is a UnitOfMeasure for the dimension of length, as is the Inch. There is no intrinsic property of a UnitOfMeasure that makes it primitive or fundamental, rather, a system of units (e.g. SystemeInternationalUnit) defines a set of orthogonal dimensions and assigns units for each. @en

Temperatuureenheid
type: Class
subclass of: Niet-samengestelde meeteenheid
creator: RS
definition: Editorial: UnitOfTemperature represents the standardized units of temperature such as 'Celsius' and 'Fahrenheit'. @en

Fysieke inhoudseenheid
type: Class
subclass of: Niet-samengestelde meeteenheid
creator: RS
definition: Editorial: UnitOfVolume represents the standardized units of volume such as 'Liter' and 'Milliliter'. @en

Uitvoering van arbeid tijdseenheid
type: Class
subclass of: Samengestelde meeteenheid
creator: RS
comment: A domain-specific example of a CompositeUnitOfMeasure is UnitOfWorkload with its instance 'FTE' or 'Full-time equivalent'. This is a unit of measure for workloads and can be defined as "the number of total hours worked divided by the maximum number of compensable hours in a full-time schedule as defined by law" (source:Wikipedia). Since the full-time schedule may vary within the Cure domain, this ontology provides additional units of measure to state that e.g. '0.8' is a data value of some QuantityValue and that it uses the CompositeUnitOfMeasure 'FTE' and the NonCompositeUnitOfMeasure '38 hours workweek'. Also see the notes for onz-g:UnitOfDuration. @en
definition: Editorial: Instances of UnitOfWorkload are units for the amount of work over a given period. @en

Geldigheidseigenschap
type: Class
subclass of: Normatieve waarde eigenschap
subclass of: Restriction
  all values from: Geldigheidswaarde
  on property: heeft eigenschapswaarde
creator: RS
comment: Note that this quality is NOT intended for statements on the existence or truth value of some Entity, e.g.: 'the building/organization/civil war existed in 2022' and 'what he said was not true/no longer true/false/a lie' do NOT refer to some ValidityQuality as modeled and defined in this ontology. @en
definition: Editorial: ValidityQuality is a NormativeQuality that is (formally) assigned to some Entity by some Human or Organization and characterizes the validity the of this Entity according to some norm, law or authority. @en
example: Examples: 'This passport is still valid', 'the contract will be effective for three years', 'my drivers license is unexpired', 'her healthcare proxy is in effect from 2021', etc. @en

Geldigheidswaarde
type: Class
subclass of: Normatieve waarde
creator: RS
definition: Instances of ValidityValue express the possible values of some ValidtyQuality such as 'expired', 'in effect', etc. @en

Variabele groep of collectie
type: Class
subclass of: Groep of collectie
subclass of: Restriction
  all values from: Variabele groep of collectie
  on property: heeft deel
creator: RS
comment: Examples: flock of sheep, military convoy, musical group, football team, a family. @en
definition: Editorial: VariableCollection is a Collection that carries an intensional Identity criterion, meaning that the Identity of the Collection is not defined by its members. I.e.: members can move in our out of the Collection without changing the Identity of the Collection. @en

Dorp of stad
type: Class
subclass of: Geopolitiek gebied
creator: RS
definition: Editorial: VillageOrCity is a GeopoliticalArea occupied by a permanent human settlement. @en
example: 'dorp', 'stad', 'buurtschap', 'gehucht', etc.

Geweldadige interactie
type: Class
subclass of: Menselijke interactie-gebeurtenis
creator: RS
comment: Note that ViolantInteraction does not impose any perspective on either the agent or the patient of some event. In other words: 'two people fighting eachother' and 'Mary assaulted John' can both be labeled as ViolentInteraction events. We refer to onz-g:Participant and its subclasses for roles that can be applied to instantiate e.g. the agent and patient of some ViolentInteraction. @en
comment: Note that the result of some AbusiveEvent may induce the change of some internal quality of some Human, though this is not always and necessarily the case for every instance. This is one of the disciminitive features between instances of onz-g:ViolentInteraction/onz-g:AbusiveEvent and onz-g:InternalChange. Note however, that some event can be labeled as e.g. onz-g:Injuring AND onz-g:PhysicalAbusiveEvent if applicable and desirable in some context. @en
definition: Editorial: ViolentInteraction is a SocialInteractionEvent in which some Human or GroupOfHumans intentionally and willfully (attempts to) cause some form of harm to some other Human or GroupOfHumans. @en
example: Examples are: terrorist attacks, war, sexual assault, sexual harassment, gaslighting, negligant events, a caregiver hitting some patient, some patient biting some caregiver, murders and murder attempts. @en

Virtueel areaal
type: Class
subclass of: Gebied of oppervlak
subclass of: Restriction
  all values from: Virtuele-plaatsidentifer
  on property: geïdentificeerd door
creator: RS
comment: VirtualAreas can be identified with a VirtualPlaceInformationObject, i.e. IP adresses, webpage addresses, etc. @en
definition: Editorial: VirtualArea is an Area that simulates or is perceived by humans as an Area but exists only digitally. @en

Virtuele-plaatsidentifer
type: Class
subclass of: Plaats- of locatieidentifier
creator: RS
definition: Editorial: VirtualPlaceInformationObject is a LocalizablePlaceInformationObject that is used to identify some virtual place by means of some identifier, i.e. a homepage, an e-mail address, etc. @en
example: Examples are: an URI, an URL, a homepage address, an email address, etc. @en

Virus
type: Class
subclass of: Organisme
creator: RS
comment: There is an ongoing debate whether Virus should be considered an Organism or not. Here, we made the pragmatic decision to model Virus as an Organism based on their ability to reproduce. @en
definition: sumo: Virus is "an Organism consisting of a core of a single nucleic acid enclosed in a protective coat of protein. A virus may replicate only inside a host living cell. A virus exhibits some but not all of the usual characteristics of living things." @en

Visuele informatie-dragend object
type: Class
subclass of: Informatiedragend artefact
creator: RS
label: Examples are: photo's, CT-scans, radiographs, X-ray scans, etc. @en
definition: Editorial: VisualContentBearingObject is a ContentBearingObject that is intended to convey meaning as the result visual interpretation. @en

Vitamine
type: Class
subclass of: Voedingsstof
creator: RS
definition: Editorial: Vitamin is a Nutrient that is necessary to maintain the normal functioning of the metabolism of some Animal. @en

Volume
type: Class
subclass of: Kwantitatief-meetbare eigenschap
subclass of: Restriction
  all values from: Fysieke inhoudswaarde
  on property: heeft eigenschap of kenmerk
creator: RS
definition: Editorial: VolumeQuality is a QuantitativeMeasurementQuality that characterizes the three dimensional space of some PhysicalEndurant, or in other words: the quality of containing a certain volume (of something). @en
example: Examples: "there is 100 liter water in this barrel", "the syringe contains 10ml insuline", etc. @en

Fysieke inhoudswaarde
type: Class
subclass of: Kwantificeerbare meetwaarde
creator: RS
definition: Editorial: Instances of VolumeValue express the quantity values of the physical quality Volume. @en

Mantelzorger
type: Class
subclass of: Vrijwilliger
creator: RS
label: VoluntaryCaregiver @en
definition: Editorial: A VoluntaryCaregiver is someone who provides long term care for a family member, friend or acquintance on a voluntary basis. @en
definition: Editorial: Een Mantelzorger is iemand die langdurig, vrijwillig en onbetaald voor een chronisch zieke, gehandicapte of hulpbehoevende partner, (schoon)ouder, kind of ander familielid, vriend of kennis zorgt.

Euthanasieverklaring
type: Class
subclass of: Fysiek certificaat
creator: RS
definition: Editorial: Euthanasieverklaring is een beschrijving waarin een Persoon een verzoek tot toekomstige euthanasie doet in het geval van bepaalde ziektes en aandoeningen indien de Persoon zelf geen beslissingen meer kan nemen over medische behandelingen of zijn eigen gezondheid door wilsonbekwaamheid veroorzaakt door ziekte of aandoeningen.
definition: Nederlands Wetboek, Wtlvhz, artikel 2: "Indien de patiënt van zestien jaren of ouder niet langer in staat is zijn wil te uiten, maar voordat hij in die staat geraakte tot een redelijke waardering van zijn belangen ter zake in staat werd geacht, en een schriftelijke verklaring, inhoudende een verzoek om levensbeëindiging, heeft afgelegd, dan kan de arts aan dit verzoek gevolg geven."

Vrijwilliger
type: Class
subclass of: Werker
creator: RS
definition: Editorial: Volunteer is the Role of some Human who freely offers to undertake a task or works for some organization without financial compensation for this labour. @en

Wachtlijst
type: Class
subclass of: Lijst
creator: RS
definition: Editorial: Wachtlijst is een InformatieObject waarin, volgens bepaalde ordeningsprincipes, de namen van Personen zijn opgenomen die wachten op het ontvangen van een dienst of bepaalde goederen.
definition: Editorial: WaitingList is an InformationObject that contains a list of person names, ordered via some ordering principle, who are waiting to receive some goods or services. @en

Rolstoeltafelblad
type: Class
subclass of: Engineering component
creator: RS
comment: Zie ook de uitleg bij de klasse onz-g:Bedrail.

Vrouw
type: Class
subclass of: Mens
subclass of: Restriction
  some values from: Vrouwelijk geslacht
  on property: heeft eigenschap of kenmerk
creator: RS

Werkperiode
type: Class
subclass of: Periode
creator: RS
comment: Note that the denotation of this class is impartial to whether or not someone was actually present at work or carried out tasks. @en
definition: Editorial: WorkPeriod is the subclass of ProperPeriod that captures all proper time intervals associated with being in employment and/or carrying out tasks. @en
example: Voorbeelden zijn: 'arbeidsjaren', 'stageperiode', 'gewerkte periode', 'contractjaar', 'ambtsperiode', 'inwerkperiode', 'inhaaldag', etc.

Werker
type: Class
subclass of: Relationele rol
creator: RS
comment: Worker represents the most neutral concept for anyone who carries out some task, irrespective of labour laws and the existence of e.g. an employment contract. @en
definition: Editorial: Worker identifies the role of some Human that carries out some task, either acting under orders of someone else and with some financial compensation or out of one's own free will and without any compensation. @en

Wond
type: Class
subclass of: Laesie
creator: RS
relation: https://zibs.nl/wiki/Wond-v3.6(2024NL)
definition: Wound is the subclass of Lesion where some damage exists in the form of e.g. a rupture, cut, puncture and/or contusion in the skin of some Animal, usually as a result of a sudden Impacting. @en
example: Voorbeelden: 'snee', 'schaafwond', 'brandwond', 'scherpe verwonding', 'stompe verwonding', etc.

CAO-VVT
type: NamedIndividual
type: Collectieve arbeidsovereenkomst

COD-163-CIZ
type: NamedIndividual
type: Codelijst

Centimeter
type: NamedIndividual
type: Lengte-eenheid

Centrum Indicatiestelling Zorg
type: NamedIndividual
type: Pubieke dienst-organisatie

Dag
type: NamedIndividual
type: Tijdsduureenheid
label: Day @en

Decubitus
type: NamedIndividual
type: Ziekte of syndroom
comment: De aandoening 'decubitus' als aanwezig in een Organisme, dus niet de individuele doorligplekken (zie:onz-g:PressureUlcer). Let op: 'decubitus' is een specifiek Nederlandse term!

EUR
type: NamedIndividual
type: Valutatype-eenheid

Europees Kwalificatie Raamwerk
type: NamedIndividual
type: Opleidingsclassificatiesysteem

Fahrenheit
type: NamedIndividual
type: Temperatuureenheid

GBP
type: NamedIndividual
type: Valutatype-eenheid

Gram
type: NamedIndividual
type: Gewichtseenheid

Jaar
type: NamedIndividual
type: Tijdsduureenheid
label: Year @en

Kilo
type: NamedIndividual
type: Gewichtseenheid

Korsakoff
type: NamedIndividual
type: Ziekte of syndroom
creator: RS

Kwaliteitswet Zorginstellingen
type: NamedIndividual
type: Gezondheidszorgwet

Maand
type: NamedIndividual
type: Tijdsduureenheid
label: Month @en

Meter
type: NamedIndividual
type: Lengte-eenheid

Ministerie van Volksgezondheid, Welzijn en Sport
type: NamedIndividual
type: Ministerie

Minuut
type: NamedIndividual
type: Tijdsduureenheid
label: Minute @en

Nederlands Kwalificatieraamwerk
type: NamedIndividual
type: Beroeps- en functieclassificatiesysteem

Nederlandse Zorgautoriteit
type: NamedIndividual
type: Pubieke dienst-organisatie

USD
type: NamedIndividual
type: Valutatype-eenheid

Uur
type: NamedIndividual
type: Tijdsduureenheid
label: Hour @en

Vierkante meter
type: NamedIndividual
type: Samengestelde meeteenheid

Wachtlijst WLZ
type: NamedIndividual
type: Wachtlijst

Week
type: NamedIndividual
type: Tijdsduureenheid

Wet Langdurige Zorg
type: NamedIndividual
type: Gezondheidszorgwet

Wet Maatschappelijke Ondersteuning
type: NamedIndividual
type: Gezondheidszorgwet

Gehuwd
type: NamedIndividual
type: BRP burgerlijke staat-waarde

Gescheiden na huwelijk
type: NamedIndividual
type: BRP burgerlijke staat-waarde

Gescheiden na partnerschap
type: NamedIndividual
type: BRP burgerlijke staat-waarde

Ongehuwd
type: NamedIndividual
type: BRP burgerlijke staat-waarde

Partnerschap
type: NamedIndividual
type: BRP burgerlijke staat-waarde

Procent
type: NamedIndividual
type: Niet-samengestelde meeteenheid

Promille
type: NamedIndividual
type: Niet-samengestelde meeteenheid

Verweduwd na huwelijk
type: NamedIndividual
type: BRP burgerlijke staat-waarde

Verweduwd na partnerschap
type: NamedIndividual
type: BRP burgerlijke staat-waarde